{"text_format":"1","workbook":"xlsx","n_sheets":22,"sheets":["Config","Instructions","Suggested Analysis Framework","Asset Inventory_Pipes","Asset Inventory_Manholes","Model Selection and Inputs","Pipe Unit Costs_Useful Life","Manhole Unit Costs_Useful Life","Consequence of Failure","Likelihood of Failure","Indiv. Pipe Results_Table","Indiv. MH Results_Table","Collection System Summary_Risk","Collection System Summary_Table","Risk-based Cost Forecast","Age-based Cost Forecast","CalsRiskPipes","Pipes by Materials_Dashboard","Pipes by Age_Dashboard","Pipes by Diameter_Dashboard","Risk Summary_Dashboard","Escalation"],"not_rendered":{"charts":8,"images":6,"macros":1,"external_links":1,"defined_names":100,"comments":10,"pivot_tables":9},"unopened":[],"bounds":{"document_bytes":16777216,"sheet_cells":100000,"rows_first":2000,"rows_last":500,"rows_between":2000,"halvings":0,"cell_chars":16384,"cell_head_chars":4096},"cells_cut":0,"cells_raw":0,"read":"whole","date_system":"1900"}

{"sheet":"Config","index":0,"n_rows":23,"n_cols":8,"rows_kept":23,"cut":false,"hidden":true,"merged":[]}
["Sheet Name","Risk Sheet","Age Based Sheet","Inventory Sheet","Inventory and Forecasting Sheet","Protect"]
["Age-based Cost Forecast",false,true,false,true,false,null,"always show (all columns TRUE)"]
["Asset Inventory_Manholes",true,true,true,true,true,null,"never show (all columns FALSE)"]
["Asset Inventory_Pipes",true,true,true,true,true]
["CalsRiskPipes",false,false,false,false,true]
["Collection System Summary_Risk",true,false,false,true,true]
["Collection System Summary_Table",false,true,false,true,true]
["Config",false,false,false,false,false]
["Consequence of Failure",true,false,false,true,true]
["Escalation",false,false,false,false,false]
["Indiv. MH Results_Table",true,true,false,true,true]
["Indiv. Pipe Results_Table",true,true,false,true,true]
["Instructions",true,true,true,true,true]
["Likelihood of Failure",true,false,false,true,true]
["Manhole Unit Costs_Useful Life",true,true,false,true,true]
["Model Selection and Inputs",true,true,false,true,true]
["Pipe Unit Costs_Useful Life",true,true,false,true,true]
["Pipes by Age_Dashboard",true,true,false,true,false]
["Pipes by Diameter_Dashboard",true,true,false,true,false]
["Pipes by Materials_Dashboard",true,true,false,true,false]
["Risk Summary_Dashboard",true,false,false,true,false]
["Risk-based Cost Forecast",true,false,false,true,false]
["Suggested Analysis Framework",true,true,true,true,true]

{"sheet":"Instructions","index":1,"n_rows":57,"n_cols":2,"rows_kept":57,"cut":false,"hidden":false,"merged":[[54,1,54,2]]}
[]
[]
[]
[]
[]
[]
[]
[]
[]
[]
[]
[]
[]
[]
[]
[]
[]
[]
[]
[]
[]
[]
[]
[]
[]
[]
[]
[]
[]
[]
[]
[]
[]
[]
[]
[]
[]
[]
[]
[]
[]
[]
[]
[]
[]
[]
[]
[]
[]
[]
[]
[]
[]
[]
[null,"Select Spreadsheet Tool "]
[null,"Inventory Only (show only inventory sheets)"]
[null,"Inventory and Forecasting Model (show all)"]

{"sheet":"Suggested Analysis Framework","index":2,"n_rows":0,"n_cols":0,"rows_kept":0,"cut":false,"hidden":false,"merged":[]}

{"sheet":"Asset Inventory_Pipes","index":3,"n_rows":2,"n_cols":15,"rows_kept":2,"cut":false,"hidden":false,"merged":[[0,0,0,6],[0,7,0,14]]}
["Tier 1 Inventory Information ",null,null,null,null,null,null,"Tier 2 Inventory Information"]
["Unique Asset ID","Basin Code, if applicable","Pipe Diameter","Material, select from list","Depth, feet","Known/Estimated Install Date","Pipe Length, feet","Proximity to Water, in feet","Critical Infrastructure Boundaries: Proximity to School or Park, in feet","Critical Infrastructure Boundaries: Proximity to Airport/Medical, in feet","Crosses Roadways, select from list","High Root Areas, select from list","Known High Grease Areas, select from list","Structural Peak Condition Score, select from list (NULL if no data available)","O&M Peak Condition Score, select from list (NULL if no data available)"]

{"sheet":"Asset Inventory_Manholes","index":4,"n_rows":2,"n_cols":8,"rows_kept":2,"cut":false,"hidden":false,"merged":[[0,0,0,5],[0,6,0,7]]}
["Tier 1 Inventory Information ",null,null,null,null,null,"Tier 2 Inventory Information"]
["Unique Asset ID","Basin Code, if applicable","Material, select from list","Inside Diameter, inches","Known/Estimated Install Year","Depth, feet","Upstream Pipe ID","Downstream PipeID"]

{"sheet":"Model Selection and Inputs","index":5,"n_rows":14,"n_cols":5,"rows_kept":14,"cut":false,"hidden":false,"merged":[[2,0,2,1],[2,3,2,4],[7,0,7,1],[7,3,7,4]]}
["Adjust Green Cells Only"]
[]
["Select Model Application",null,null,"Define Planning Horizon"]
["Estimate Rehab Costs by System Risk? ",true,null,"Planning Horizon (years)",20]
["Estimate Rehab Costs by Age?",true,null,"Number of Planning Periods",5]
[null,null,null,"First Year of Planning Period",2022]
[]
["Set Pipe Rehabilitation Rate Assumptions",null,null,"Set Manhole Rehabilitation Rate Assumptions"]
["Targeted Annual Rehabilitation Rate",0.01,null,"Targeted Annual Rehabilitation Rate",0.01]
["Total Pipe Yield Rate (calculated)",{"$f":"$B$9*$E$4","v":0.2},null,"Total Manhole Yield Rate (calculated)",{"$f":"Planning_Horizon__years*E9","v":0.2}]
["Assumed Annual Lining Rate",0.45,null,"Assumed Annual Lining Rate",0.15]
["Assumed Annual Replacement Rate",0.2,null,"Assumed Annual Replacement Rate",0.1]
["Assumed Annual Repair Rate",0.35,null,"Assumed Annual Repair Rate",0.75]
[null,{"$f":"SUM(B11:B13)","v":1},null,null,{"$f":"SUM(E11:E13)","v":1}]

{"sheet":"Pipe Unit Costs_Useful Life","index":6,"n_rows":45,"n_cols":18,"rows_kept":45,"cut":false,"hidden":false,"merged":[[41,2,41,5],[42,2,42,5],[43,2,43,5],[44,2,44,5],[36,2,36,5],[37,2,37,5],[38,2,38,5],[39,2,39,5],[40,2,40,5],[2,0,2,8],[25,0,25,8],[25,9,25,15],[25,16,26,16],[25,17,26,17],[9,0,9,1],[11,0,11,1]]}
["Adjust Green Cells Only"]
[]
["Unit Costs for Open Cut Pipe Replacment ($/ft)",null,null,null,null,null,null,null,null,null,"Pipe Material Recommendations","Estimated Useful Life (Year)"]
["Pipe Material Types","Pipe Material Groups","Less than 8\"","8\"-10\"","10-12\" ","12-20\"","20-30\"","Greater than 30\"","Unknown",null,"Non-Plastic",50]
["VCP, Unknown, Not lined","Non-Plastic",97.5,117.5,132.5,235,380,650,155,null,"Lined Non-Plastic",50]
["Lined Non-Plastic","Lined Non-Plastic",97.5,117.5,132.5,235,380,650,155,null,"Plastic",75]
["PVC, HDPE","Plastic",97.5,117.5,132.5,235,380,650,155,null,"Unknown",50]
["Unknown","Unknown",97.5,117.5,132.5,235,380,650,180,null," "," "]
[]
["Cost Escalation"]
["Annual Inflation",2.5000000000000001E-2]
["Set Pipe Rehabilitation Cost Assumptions"]
["Lining Cost",0.45]
["Repair Cost",0.2]
["Replacement Cost",1]
[]
[]
["Less than 8\"",0,7,"Less than 8\""]
["8\"-10\"",8,10,"8\"-10\""]
["10-12\" ",11,12,"10-12\" "]
["12-20\"",13,20,"12-20\""]
["20-30\"",21,30,"20-30\""]
["Greater than 30\"",31,1000,"Greater than 30\""]
[]
[]
["Unit Costs for Open Cut Pipe Replacment ($/ft)",null,null,null,null,null,null,null,null,"TOTAL LENGTH BY DIAMETER GROUP (FT.)",null,null,null,null,null,null,"DIA WEIGHTED AVERAGE","TOTAL LENGTH BY MATERIAL"]
["Pipe Material Types","Pipe Material Groups","Less than 8\"","8\"-10\"","10-12\" ","12-20\"","20-30\"","Greater than 30\"","Unknown","Less than 8\"","8\"-10\"","10-12\" ","12-20\"","20-30\"","Greater than 30\"","Unknown"]
["VCP, Unknown, Not lined","Non-Plastic",{"$f":"C5","v":97.5},117.5,132.5,235,380,650,155,{"$f":"SUMIFS(Table3[Pipe Length, feet],Table3[Material, select from list],$B28,Table3[DIA CAT.],J$27)","v":0},{"$f":"SUMIFS(Table3[Pipe Length, feet],Table3[Material, select from list],$B28,Table3[DIA CAT.],K$27)","v":0},{"$f":"SUMIFS(Table3[Pipe Length, feet],Table3[Material, select from list],$B28,Table3[DIA CAT.],L$27)","v":0},{"$f":"SUMIFS(Table3[Pipe Length, feet],Table3[Material, select from list],$B28,Table3[DIA CAT.],M$27)","v":0},{"$f":"SUMIFS(Table3[Pipe Length, feet],Table3[Material, select from list],$B28,Table3[DIA CAT.],N$27)","v":0},{"$f":"SUMIFS(Table3[Pipe Length, feet],Table3[Material, select from list],$B28,Table3[DIA CAT.],O$27)","v":0},{"$f":"SUMIFS(Table3[Pipe Length, feet],Table3[Material, select from list],$B28,Table3[DIA CAT.],P$27)","v":0},{"$f":"IFERROR(SUMPRODUCT(C28:I28,J28:P28)/SUM(J28:P28),0)","v":0},{"$f":"SUM(J28:P28)","v":0}]
["Lined Non-Plastic","Lined Non-Plastic",97.5,117.5,132.5,235,380,650,155,{"$f":"SUMIFS(Table3[Pipe Length, feet],Table3[Material, select from list],$B29,Table3[DIA CAT.],J$27)","v":0},{"$f":"SUMIFS(Table3[Pipe Length, feet],Table3[Material, select from list],$B29,Table3[DIA CAT.],K$27)","v":0},{"$f":"SUMIFS(Table3[Pipe Length, feet],Table3[Material, select from list],$B29,Table3[DIA CAT.],L$27)","v":0},{"$f":"SUMIFS(Table3[Pipe Length, feet],Table3[Material, select from list],$B29,Table3[DIA CAT.],M$27)","v":0},{"$f":"SUMIFS(Table3[Pipe Length, feet],Table3[Material, select from list],$B29,Table3[DIA CAT.],N$27)","v":0},{"$f":"SUMIFS(Table3[Pipe Length, feet],Table3[Material, select from list],$B29,Table3[DIA CAT.],O$27)","v":0},{"$f":"SUMIFS(Table3[Pipe Length, feet],Table3[Material, select from list],$B29,Table3[DIA CAT.],P$27)","v":0},{"$f":"IFERROR(SUMPRODUCT(C29:I29,J29:P29)/SUM(J29:P29),0)","v":0},{"$f":"SUM(J29:P29)","v":0}]
["PVC, HDPE","Plastic",{"$f":"C7","v":97.5},117.5,132.5,235,380,650,155,{"$f":"SUMIFS(Table3[Pipe Length, feet],Table3[Material, select from list],$B30,Table3[DIA CAT.],J$27)","v":0},{"$f":"SUMIFS(Table3[Pipe Length, feet],Table3[Material, select from list],$B30,Table3[DIA CAT.],K$27)","v":0},{"$f":"SUMIFS(Table3[Pipe Length, feet],Table3[Material, select from list],$B30,Table3[DIA CAT.],L$27)","v":0},{"$f":"SUMIFS(Table3[Pipe Length, feet],Table3[Material, select from list],$B30,Table3[DIA CAT.],M$27)","v":0},{"$f":"SUMIFS(Table3[Pipe Length, feet],Table3[Material, select from list],$B30,Table3[DIA CAT.],N$27)","v":0},{"$f":"SUMIFS(Table3[Pipe Length, feet],Table3[Material, select from list],$B30,Table3[DIA CAT.],O$27)","v":0},{"$f":"SUMIFS(Table3[Pipe Length, feet],Table3[Material, select from list],$B30,Table3[DIA CAT.],P$27)","v":0},0,0]
["Unknown","Unknown",{"$f":"C8","v":97.5},117.5,132.5,235,380,650,180,{"$f":"SUMIFS(Table3[Pipe Length, feet],Table3[Material, select from list],$B31,Table3[DIA CAT.],J$27)","v":0},{"$f":"SUMIFS(Table3[Pipe Length, feet],Table3[Material, select from list],$B31,Table3[DIA CAT.],K$27)","v":0},{"$f":"SUMIFS(Table3[Pipe Length, feet],Table3[Material, select from list],$B31,Table3[DIA CAT.],L$27)","v":0},{"$f":"SUMIFS(Table3[Pipe Length, feet],Table3[Material, select from list],$B31,Table3[DIA CAT.],M$27)","v":0},{"$f":"SUMIFS(Table3[Pipe Length, feet],Table3[Material, select from list],$B31,Table3[DIA CAT.],N$27)","v":0},{"$f":"SUMIFS(Table3[Pipe Length, feet],Table3[Material, select from list],$B31,Table3[DIA CAT.],O$27)","v":0},{"$f":"SUMIFS(Table3[Pipe Length, feet],Table3[Material, select from list],$B31,Table3[DIA CAT.],P$27)","v":0},0,0]
[]
[{"$f":"Table3[[#Headers],[Material, select from list]]","v":"Material, select from list"}]
[{"$f":"Table3[[#Headers],[DIA CAT.]]","v":"DIA CAT."}]
[{"$f":"Table3[[#Headers],[Pipe Length, feet]]","v":"Pipe Length, feet"}]
[]
["Total Length:",{"$f":"SUM(Table3[Pipe Length, feet])","v":0},"ft."]
["renewal unit cost factor:",{"$f":"LiningRate*LiningPctUC+RepairRate*RepairPctUC+ReplacementRate*ReplacementPctUC","v":0.47250000000000003},"sum product of renewal rates and unit cost factors by type"]
["WEIGHTED AVERAGE (DIA & MTL):",{"$f":"SUMPRODUCT(Q28:Q31,R28:R31)/SUM(R28:R31)","v":{"$error":"#DIV/0!"}},"weighted across diameter & material"]
["TOTAL WEIGHTED AVG (DIA/MTL/ REHAB METHOD):",{"$f":"B39*B38","v":{"$error":"#DIV/0!"}},"weighted across dia, material, and rehab method\n126 * 0.4725"]
[]
["Math checks:"]
["100% REPLACEMENT",{"$f":"SUM(Table3[Replacement Cost])","v":0},"Replacing 100% of pipes"]
["100% MIXED RENEWAL:",{"$f":"B43*renewal_unit_cost_factor","v":0},"Renewing 100% of pipes using mix of renewal methods:\n60,450,682 * 0.4725"]
["TOTAL LENGTH * TOTAL WEIGHTED AVG:",{"$f":"B37*unit_cost_weighted","v":{"$error":"#DIV/0!"}},"Check above calc.\n480,979 * 59.4 = $28.6M"]

{"sheet":"Manhole Unit Costs_Useful Life","index":7,"n_rows":12,"n_cols":3,"rows_kept":12,"cut":false,"hidden":false,"merged":[[8,0,8,1]]}
["Adjust Green Cells Only"]
[]
["Manhole/Node Material Recommendations","Replacement Unit Cost (Each)","Esimated Useful Life (Year)"]
["Brick",15000,50]
["Precast Concrete",15000,50]
["Plastic/Fiberglass",15000,50]
["Other",15000,50]
[]
["Set Manhole Rehabilitation Cost Assumptions"]
["Lining Cost",0.1]
["Repair Cost",0.15]
["Replacement Cost",1]

{"sheet":"Consequence of Failure","index":8,"n_rows":33,"n_cols":9,"rows_kept":33,"cut":false,"hidden":false,"merged":[[27,0,31,0],[27,1,31,1],[27,5,31,5],[27,7,31,7],[22,0,25,0],[22,1,25,1],[22,5,25,5],[22,7,25,7],[14,0,16,0],[14,1,16,1],[14,5,16,5],[14,7,16,7],[18,0,21,0],[18,1,21,1],[18,5,21,5],[18,7,21,7],[7,5,9,5],[7,7,9,7],[11,0,13,0],[11,1,13,1],[11,5,13,5],[11,7,13,7],[2,0,2,1],[1,0,1,1],[3,0,3,1],[7,0,9,0],[7,1,9,1]]}
["Adjust Green Cells Only"]
["Max COF Score",null,40]
["Percentage of Total Risk Score:",null,0.4]
["System Mileage",null,{"$f":"SUM(Table3[LengthMiles])","v":0}]
["Consequence of Failure Risk Analysis Matrix"]
["Performance Measure ","Potential GIS Data Source","Scoring Criteria","Scoring Criteria Threshold","Score ","Performance Measure Weight, %","Total Miles","Weighted Max Score"]
["Environment and Public Health"]
["Proximity to Water","NHD Major Rivers, Creeks, Lakes",{"$f":"\"Less than or equal to \" & D8 & \"'\"","v":"Less than or equal to 100'"},100,10,0.3,{"$f":"SUMIF(Table3[Proximity to Water, in feet],\"<=\"&D8,Table3[LengthMiles])","v":0},{"$f":"F8*$C$2","v":12}]
[null,null,{"$f":"D8 & \"' to \" & D9 & \"'\"","v":"100' to 250'"},250,5,null,{"$f":"SUMIFS(Table3[LengthMiles],Table3[Proximity to Water, in feet],\">\"&D8,Table3[Proximity to Water, in feet],\"<=\"&D9)","v":0},null," "]
[null,null,{"$f":"\"Further than \" & D9 & \"'\"","v":"Further than 250'"},250,1,null,{"$f":"SUMIF(Table3[Proximity to Water, in feet],\">\"&D10,Table3[LengthMiles])","v":0}]
["Critical Infrastructure"]
["School or Park Boundary","Locations of schools and parks",{"$f":"\"Less than or equal to \" & D12 & \"'\"","v":"Less than or equal to 100'"},100,10,0.1,{"$f":"SUMIF(Table3[Critical Infrastructure Boundaries: Proximity to School or Park, in feet],\"<=\"&D12,Table3[LengthMiles])","v":0},{"$f":"F12*$C$2","v":4}]
[null,null,{"$f":"D12 & \"' - \" & D13 & \"'\"","v":"100' - 250'"},250,5,null,{"$f":"SUMIFS(Table3[LengthMiles],Table3[Critical Infrastructure Boundaries: Proximity to School or Park, in feet],\">\"&D12,Table3[Critical Infrastructure Boundaries: Proximity to School or Park, in feet],\"<=\"&D13)","v":0}]
[null,null,{"$f":"\"Further than \" & D14 & \"'\"","v":"Further than 250'"},250,1,null,{"$f":"SUMIF(Table3[Critical Infrastructure Boundaries: Proximity to School or Park, in feet],\">\"&D14,(Table3[LengthMiles]))","v":0}]
["Critical Infrastructure Boundaries (Airport/Medical)","Airport/Hospital",{"$f":"\"Less than or equal to \" & D15 & \"'\"","v":"Less than or equal to 100'"},100,10,0.1,{"$f":"SUMIF(Table3[Critical Infrastructure Boundaries: Proximity to Airport/Medical, in feet],\"<=\"&D15,Table3[LengthMiles])","v":0},{"$f":"F15*$C$2","v":4}]
[null,null,{"$f":"D15 & \"' - \" & D16 & \"'\"","v":"100' - 250'"},250,5,null,{"$f":"SUMIFS(Table3[LengthMiles],Table3[Critical Infrastructure Boundaries: Proximity to Airport/Medical, in feet],\">\"&D15,Table3[Critical Infrastructure Boundaries: Proximity to Airport/Medical, in feet],\"<=\"&D16)","v":0}]
[null,null,{"$f":"\"Further than \" & D17 & \"'\"","v":"Further than 250'"},250,1,null,{"$f":"SUMIF(Table3[Critical Infrastructure Boundaries: Proximity to Airport/Medical, in feet],\">\"&D17,(Table3[LengthMiles]))","v":0}]
["Potential for Difficulty of Repair"]
["Crosses Roadways","Roadway Layer specific CFCC Codes ID for primary/secondary",{"$f":"\"Crosses \" & D19","v":"Crosses RAIL"},"RAIL",10,0.1,{"$f":"SUMIF(Table3[Crosses Roadways, select from list],\"=\"&D19,Table3[LengthMiles])","v":0},{"$f":"F19*C2","v":4}]
[null,null,{"$f":"\"Crosses \" & D20","v":"Crosses HIGHWAY"},"HIGHWAY",7,null,{"$f":"SUMIF(Table3[Crosses Roadways, select from list],\"=\"&D20,Table3[LengthMiles])","v":0}]
[null,null,"Crosses CITY","CITY",5,null,{"$f":"SUMIF(Table3[Crosses Roadways, select from list],\"=\"&D21,Table3[LengthMiles])","v":0}]
[null,null,"Crosses OTHER","OTHER",1,null,{"$f":"SUMIF(Table3[Crosses Roadways, select from list],\"=\"&D22,Table3[LengthMiles])","v":0}]
["Depth","Attribute Data",{"$f":"\"Greater than \" & D23 & \"'\"","v":"Greater than 16'"},16,10,0.1,{"$f":"SUMIF(Table3[Depth, feet],\">=\"&D23,Table3[LengthMiles])","v":0},{"$f":"F23*C2","v":4}]
[null,null,{"$f":"D24 & \"' to \" & D23 & \"'\"","v":"8' to 16'"},8,5,null,{"$f":"SUMIFS(Table3[LengthMiles],Table3[Depth, feet],\"<\"&D23,Table3[Depth, feet],\">=\"&D24)","v":0}]
[null,null,"Unknown",null,5,null,{"$f":"SUMIF(Table3[Depth, feet],\"=\"&D25,Table3[LengthMiles])","v":0}]
[null,null,{"$f":"\"0' to \" & D26 & \"'\"","v":"0' to 8'"},{"$f":"D24","v":8},1,null,{"$f":"SUMIF(Table3[Depth, feet],\"<=\"&D26,Table3[LengthMiles])","v":0}]
["Capacity"]
["Size of Sewer","Attribute Data",{"$f":"\"Greater than \"&D28&\"\"\"\"","v":"Greater than 36\""},36,10,0.3,0,{"$f":"F28*C2","v":12}]
[null,null,{"$f":"D29 & \"\"\"\" & \" to \" & D28 & \"\"\"\"","v":"24\" to 36\""},24,7,null,2.7712244619528015]
[null,null,{"$f":"D30 & \"\"\"\" & \" to \" & D29 & \"\"\"\"","v":"14\" to 24\""},14,5,null,9.5247608514476916]
[null,null,"Unknown","Unknown",3,null,4.3015712999530002]
[null,null,{"$f":"\"Less than or equal to \" & D32 & \"\"\"\"","v":"Less than or equal to 12\""},12,1,null,74.402279065004578]
[null,null,null,null,null,{"$f":"SUM(F8,F12,F15,F19,F23,F28)","v":1},null,{"$f":"SUM(H8,H12,H15,H19,H23,H28)","v":40}]

{"sheet":"Likelihood of Failure","index":9,"n_rows":39,"n_cols":8,"rows_kept":39,"cut":false,"hidden":false,"merged":[[1,0,1,1],[2,0,2,1],[3,0,3,1],[27,7,30,7],[16,5,18,5],[19,5,21,5],[7,7,10,7],[11,7,14,7],[16,7,18,7],[19,7,21,7],[23,7,26,7],[7,0,10,0],[7,1,10,1],[27,1,30,1],[23,1,26,1],[7,5,10,5],[27,5,30,5],[27,0,30,0],[16,0,18,0],[11,5,14,5],[11,1,14,1],[16,1,18,1],[19,0,21,0],[19,1,21,1],[11,0,14,0],[23,0,26,0],[23,5,26,5]]}
["Adjust Green Cells Only"]
["Max LOF Score",null,60]
["Percentage of Total Risk Score:",null,0.6]
["System Mileage",null,{"$f":"SUM(Table3[LengthMiles])","v":0}]
["Likelihood of Failure Risk Analysis Matrix"]
["Performance Measure ","Potential GIS Data Source","Scoring Criteria","Scoring Criteria Threshold","Score ","Performance Measure Weight, %","Total Miles","Weighted Max Score"]
["Age and Material"]
["Age","Attribute data (Used install date for MH, If blank used UPS then DS pipe Install Date, Then Interpolation TOOL",{"$f":"\"Greater than \" &D8 & \" years\"","v":"Greater than 100 years"},100,10,0.1,{"$f":"SUMIF(Table3[Age],\">=\"&D8,Table3[LengthMiles])","v":0},{"$f":"F8*$C$2","v":6}]
[null,null,{"$f":"\"Greater than \" &D9 & \" years\"","v":"Greater than 75 years"},75,7,null,{"$f":"SUMIFS(Table3[LengthMiles],Table3[Age],\"<\"&D8,Table3[Age],\">=\"&D9)","v":0}]
[null,null,"Unknown",null,5,null,{"$f":"SUMIFS(Table3[LengthMiles],Table3[Age],\"<\"&D9,Table3[Age],\">=\"&D10)","v":0}]
[null,null,{"$f":"\"Less than \" &D11 &\" years \"","v":"Less than 50 years "},50,1,null,{"$f":"SUMIF(Table3[Age],\"<\"&D11,Table3[LengthMiles])","v":0}]
["Material","Attribute data  ","Non-Plastic","Non-Plastic",10,0.25,{"$f":"SUMIF(Table3[Material, select from list],\"=\"&D12,Table3[LengthMiles])","v":0},{"$f":"F12*$C$2","v":15}]
[null,null,{"$f":"D13","v":"Lined Non-Plastic"},"Lined Non-Plastic",7,null,{"$f":"SUMIF(Table3[Material, select from list],\"=\"&D13,Table3[LengthMiles])","v":0}]
[null,null,{"$f":"D14","v":"Plastic"},"Plastic",5,null,{"$f":"SUMIF(Table3[Material, select from list],\"=\"&D14,Table3[LengthMiles])","v":0}]
[null,null,"Unknown","Unknown",1,null,{"$f":"SUMIF(Table3[Material, select from list],\"=\"&D15,Table3[LengthMiles])","v":0}]
["Known Problem Areas"]
["High Root Areas","\"Hot Spots\"",{"$f":"D17&\" Root Area\"","v":"HIGH Root Area"},"HIGH",10,0.1,{"$f":"SUMIF(Table3[High Root Areas, select from list],\"=\" &D17,Table3[LengthMiles])","v":0},{"$f":"F17*C2","v":6}]
[null,null,{"$f":"D18&\" Root Area\"","v":"MEDIUM Root Area"},"MEDIUM",5,null,{"$f":"SUMIF(Table3[High Root Areas, select from list],\"=\" &D18,Table3[LengthMiles])","v":0}]
[null,null,"LOW Root Area","LOW",1,null,{"$f":"SUMIF(Table3[High Root Areas, select from list],\"=\" &D19,Table3[LengthMiles])","v":0}]
["Known High Grease Areas","\"Hot Spots\"",{"$f":"D20&\" Grease Area\"","v":"HIGH Grease Area"},"HIGH",10,0.35,{"$f":"SUMIF(Table3[Known High Grease Areas, select from list],\"=\"&D20,Table3[LengthMiles])","v":0},{"$f":"F20*C2","v":21}]
[null,null,{"$f":"D21&\" Grease Area\"","v":"MEDIUM Grease Area"},"MEDIUM",5,null,{"$f":"SUMIF(Table3[Known High Grease Areas, select from list],\"=\"&D21,Table3[LengthMiles])","v":0}]
[null,null,"LOW Grease Area","LOW",1,null,{"$f":"SUMIF(Table3[Known High Grease Areas, select from list],\"=\"&D22,Table3[LengthMiles])","v":0}]
["Condition Assessment"]
["Structural Peak Score","Inspection Condition Survey Score",{"$f":"\"Peak Score of \" &D24","v":"Peak Score of 5"},5,10,0.1,{"$f":"SUMIF(Table3[Structural Peak Condition Score, select from list (NULL if no data available)],\"=\"&D24,Table3[LengthMiles])","v":0},{"$f":"F24*C2","v":6}]
[null,null,{"$f":"\"Peak Score of \" &D25","v":"Peak Score of 4"},4,5,null,{"$f":"SUMIF(Table3[Structural Peak Condition Score, select from list (NULL if no data available)],\"=\"&D25,Table3[LengthMiles])","v":0}]
[null,null,{"$f":"\"Peak Score of \"&D26&\" and less\"","v":"Peak Score of 3 and less"},3,1,null,{"$f":"SUMIF(Table3[Structural Peak Condition Score, select from list (NULL if no data available)],\"<=\"&D26,Table3[LengthMiles])","v":0}]
[null,null,"Unknown","NULL",3,null,{"$f":"SUMIF(Table3[Structural Peak Condition Score, select from list (NULL if no data available)],\"=\"&D27,Table3[LengthMiles])","v":0}]
["O&M Peak Score","Inspection Condition Survey Score",{"$f":"\"Peak Score of \" &D28","v":"Peak Score of 5"},5,10,0.1,{"$f":"SUMIF(Table3[Structural Peak Condition Score, select from list (NULL if no data available)],\">=\"&D28,Table3[LengthMiles])","v":0},{"$f":"F28*C2","v":6}]
[null,null,{"$f":"\"Peak Score of \" &D29","v":"Peak Score of 4"},4,5,null,{"$f":"SUMIF(Table3[Structural Peak Condition Score, select from list (NULL if no data available)],\"=\"&D29,Table3[LengthMiles])","v":0}]
[null,null,{"$f":"\"Peak Score of \"&D30&\" and less\"","v":"Peak Score of 2 and less"},2,1,null,{"$f":"SUMIF(Table3[Structural Peak Condition Score, select from list (NULL if no data available)],\"<=\"&D30,Table3[LengthMiles])","v":0}]
[null,null,"Unknown","NULL",3,null,{"$f":"SUMIF(Table3[Structural Peak Condition Score, select from list (NULL if no data available)],\"=\"&D31,Table3[LengthMiles])","v":0}]
[null,null,null,null,null,{"$f":"SUM(F8,F12,F17,F20,F24,F28)","v":0.99999999999999989},null,{"$f":"SUM(H8,H12,H17,H20,H24,H28)","v":60}]
[]
[]
[]
[]
[]
[]
[null,null," "]

{"sheet":"Indiv. Pipe Results_Table","index":10,"n_rows":1,"n_cols":41,"rows_kept":1,"cut":false,"hidden":false,"merged":[]}
["Unique Asset ID","Basin Code, if applicable","Pipe Diameter","Material, select from list","Depth, feet","Known/Estimated Install Date","Age","Pipe Length, feet","LengthMiles","Proximity to Water, in feet","Critical Infrastructure Boundaries: Proximity to School or Park, in feet","Critical Infrastructure Boundaries: Proximity to Airport/Medical, in feet","Crosses Roadways, select from list","High Root Areas, select from list","Known High Grease Areas, select from list","Structural Peak Condition Score, select from list (NULL if no data available)","O&M Peak Condition Score, select from list (NULL if no data available)","COF_Proximity to Water","COF_SchoolorPark","COF_Medical_Airport","COF_Road","COF_Depth","COF_PipeSize","Total COF Score","LOF Age","LOF Material","LOF Root Area","LOF Grease Area","LOF Structural Score","LOF O&M Score","Total LOF Score","Total Risk","EUL of pipe","YRS Beyond EUL","DIA CAT.","Replacement Unit Cost","Replacement Cost","Weighted Rehab Cost","Cumulative Cost","Rehab Year (Risk Based)","Rehab Year (EUL Based)"]

{"sheet":"Indiv. MH Results_Table","index":11,"n_rows":2,"n_cols":17,"rows_kept":2,"cut":false,"hidden":false,"merged":[]}
["Unique Asset ID","Basin Code, if applicable","Inside Diameter, inches","Material, select from list","Depth, feet","Known/Estimated Install Year","Age","Upstream Pipe ID","Downstream PipeID","COF_Pipe","LOF_Pipe","Total Risk","EUL of MH","YRS Beyond EUL","Replacement Cost","Repair Cost","Lining Cost"]
[null,null,null,null,null,null,{"$f":"IF( TableMH[[#This Row],[Known/Estimated Install Year]]<>\"\",YEAR(TODAY())-(TableMH[[#This Row],[Known/Estimated Install Year]]),\"\")","v":""},null,null,{"$f":"MAX(VLOOKUP(TableMH[[#This Row],[Upstream Pipe ID]],Table3[],24,FALSE),VLOOKUP(TableMH[[#This Row],[Downstream PipeID]],Table3[],24,FALSE))","v":{"$error":"#N/A"}},{"$f":"MAX(VLOOKUP(TableMH[[#This Row],[Downstream PipeID]],Table3[],31,FALSE),VLOOKUP(TableMH[[#This Row],[Upstream Pipe ID]],Table3[],31,FALSE))","v":{"$error":"#N/A"}},{"$f":"TableMH[[#This Row],[COF_Pipe]]+TableMH[[#This Row],[LOF_Pipe]]","v":{"$error":"#N/A"}},{"$f":"VLOOKUP(TableMH[[#This Row],[Material, select from list]],'Manhole Unit Costs_Useful Life'!$A$4:$C$7,3,FALSE)","v":{"$error":"#N/A"}},{"$f":"TableMH[[#This Row],[Age]]-TableMH[[#This Row],[EUL of MH]]","v":{"$error":"#VALUE!"}},{"$f":"VLOOKUP(TableMH[[#This Row],[Material, select from list]],'Manhole Unit Costs_Useful Life'!$A$4:$C$7,2,FALSE)*1","v":{"$error":"#N/A"}},{"$f":"TableMH[[#This Row],[Replacement Cost]]*RepairCostMH","v":{"$error":"#N/A"}},{"$f":"TableMH[[#This Row],[Replacement Cost]]*LiningCostMH","v":{"$error":"#N/A"}}]

{"sheet":"Collection System Summary_Risk","index":12,"n_rows":53,"n_cols":19,"rows_kept":53,"cut":false,"hidden":false,"merged":[[28,12,31,12],[28,13,31,13],[28,14,31,14],[32,12,33,12],[32,13,33,13],[32,14,33,14],[28,10,31,10],[28,11,31,11],[32,2,33,2],[32,3,33,3],[32,4,33,4],[32,5,33,5],[32,6,33,6],[32,7,33,7],[32,8,33,8],[32,9,33,9],[32,10,33,10],[32,11,33,11],[5,6,5,13],[5,0,5,5],[32,15,33,15],[27,0,27,16],[28,2,31,2],[28,3,31,3],[28,4,31,4],[28,5,31,5],[28,6,31,6],[28,7,31,7],[28,8,31,8],[28,15,31,15],[28,16,31,16],[32,0,33,0],[32,1,33,1],[28,9,31,9]]}
["Risk Breaks "," "]
["High",45]
["Medium ",35]
["Low",25]
["Pipe Data"]
["System Estimates",null,null,null,null,null,"Total Mileage and Costs"]
["Pipe Material","% of Total System","System Mileage","Miles within Low Risk","Miles within Medium Risk ","Miles within High Risk","Miles Estimated For Repair","Miles Estimated for Lining ","Miles Estimated for Replacement","Miles Estimated For Rehabilitation","Estimated Repair Costs","Total Estimated Lining Costs","Total Estimated Replacement Costs","Total Estimated Rehabilitation Costs"]
["Non-Plastic",{"$f":"(SUMIF(Table3[Material, select from list],\"=\"&A8,Table3[LengthMiles]))/SUM(Table3[LengthMiles])","v":{"$error":"#DIV/0!"}},{"$f":"(SUMIF(Table3[Material, select from list],\"=\"&A8,Table3[LengthMiles]))","v":0},{"$f":"(SUMIFS(Table3[LengthMiles],Table3[Material, select from list],\"=\"&A8,Table3[Total Risk],\"<=\" &LowRiskBreak))","v":0},{"$f":"(SUMIFS(Table3[LengthMiles],Table3[Material, select from list],\"=\"&A8,Table3[Total Risk],\"<\" &HighRiskBreak,Table3[Total Risk],\">=\" &LowRiskBreak))","v":0},{"$f":"(SUMIFS(Table3[LengthMiles],Table3[Material, select from list],\"=\"&A8,Table3[Total Risk],\">=\" &HighRiskBreak))","v":0},{"$f":"(Table47[[#This Row],[Miles within High Risk]]+Table47[[#This Row],[Miles within Medium Risk ]]+Table47[[#This Row],[Miles within Low Risk]])*RepairRate*yield_pipe","v":0},{"$f":"(Table47[[#This Row],[Miles within High Risk]]+Table47[[#This Row],[Miles within Medium Risk ]]+Table47[[#This Row],[Miles within Low Risk]])*LiningRate*yield_pipe","v":0},{"$f":"(Table47[[#This Row],[Miles within High Risk]]+Table47[[#This Row],[Miles within Medium Risk ]]+Table47[[#This Row],[Miles within Low Risk]])*ReplacementRate*yield_pipe","v":0},{"$f":"SUM(Table47[[#This Row],[Miles Estimated For Repair]:[Miles Estimated for Replacement]])","v":0},{"$f":"SUMIFS(Table3[Replacement Cost],Table3[Material, select from list],\"=\"&A8,Table3[Total Risk],\">=0\" )*RepairRate*RepairPctUC*yield_pipe","v":0},{"$f":"SUMIFS(Table3[Replacement Cost],Table3[Material, select from list],\"=\"&A8,Table3[Total Risk],\">=0\" )*LiningRate*LiningPctUC*yield_pipe","v":0},{"$f":"SUMIFS(Table3[Replacement Cost],Table3[Material, select from list],\"=\"&A8,Table3[Total Risk],\">=0\" )*ReplacementRate*ReplacementPctUC*yield_pipe","v":0},{"$f":"K8+L8+M8","v":0}]
["Lined Non-Plastic",{"$f":"(SUMIF(Table3[Material, select from list],\"=\"&A9,Table3[LengthMiles]))/SUM(Table3[LengthMiles])","v":{"$error":"#DIV/0!"}},{"$f":"(SUMIF(Table3[Material, select from list],\"=\"&A9,Table3[LengthMiles]))","v":0},{"$f":"(SUMIFS(Table3[LengthMiles],Table3[Material, select from list],\"=\"&A9,Table3[Total Risk],\"<=\" &LowRiskBreak))","v":0},{"$f":"(SUMIFS(Table3[LengthMiles],Table3[Material, select from list],\"=\"&A9,Table3[Total Risk],\"<\" &HighRiskBreak,Table3[Total Risk],\">=\" &LowRiskBreak))","v":0},{"$f":"(SUMIFS(Table3[LengthMiles],Table3[Material, select from list],\"=\"&A9,Table3[Total Risk],\">=\" &HighRiskBreak))","v":0},{"$f":"(Table47[[#This Row],[Miles within High Risk]]+Table47[[#This Row],[Miles within Medium Risk ]]+Table47[[#This Row],[Miles within Low Risk]])*RepairRate*yield_pipe","v":0},{"$f":"(Table47[[#This Row],[Miles within High Risk]]+Table47[[#This Row],[Miles within Medium Risk ]]+Table47[[#This Row],[Miles within Low Risk]])*LiningRate*yield_pipe","v":0},{"$f":"(Table47[[#This Row],[Miles within High Risk]]+Table47[[#This Row],[Miles within Medium Risk ]]+Table47[[#This Row],[Miles within Low Risk]])*ReplacementRate*yield_pipe","v":0},{"$f":"SUM(Table47[[#This Row],[Miles Estimated For Repair]:[Miles Estimated for Replacement]])","v":0},{"$f":"SUMIFS(Table3[Replacement Cost],Table3[Material, select from list],\"=\"&A9,Table3[Total Risk],\">=0\" )*RepairRate*RepairPctUC*yield_pipe","v":0},{"$f":"SUMIFS(Table3[Replacement Cost],Table3[Material, select from list],\"=\"&A9,Table3[Total Risk],\">=0\" )*LiningRate*LiningPctUC*yield_pipe","v":0},{"$f":"SUMIFS(Table3[Replacement Cost],Table3[Material, select from list],\"=\"&A9,Table3[Total Risk],\">=0\" )*ReplacementRate*ReplacementPctUC*yield_pipe","v":0},{"$f":"K9+L9+M9","v":0}]
["Plastic",{"$f":"(SUMIF(Table3[Material, select from list],\"=\"&A10,Table3[LengthMiles]))/SUM(Table3[LengthMiles])","v":{"$error":"#DIV/0!"}},{"$f":"(SUMIF(Table3[Material, select from list],\"=\"&A10,Table3[LengthMiles]))","v":0},{"$f":"(SUMIFS(Table3[LengthMiles],Table3[Material, select from list],\"=\"&A10,Table3[Total Risk],\"<=\" &LowRiskBreak))","v":0},{"$f":"(SUMIFS(Table3[LengthMiles],Table3[Material, select from list],\"=\"&A10,Table3[Total Risk],\"<\" &HighRiskBreak,Table3[Total Risk],\">=\" &LowRiskBreak))","v":0},{"$f":"(SUMIFS(Table3[LengthMiles],Table3[Material, select from list],\"=\"&A10,Table3[Total Risk],\">=\" &HighRiskBreak))","v":0},{"$f":"(Table47[[#This Row],[Miles within High Risk]]+Table47[[#This Row],[Miles within Medium Risk ]]+Table47[[#This Row],[Miles within Low Risk]])*RepairRate*yield_pipe","v":0},{"$f":"(Table47[[#This Row],[Miles within High Risk]]+Table47[[#This Row],[Miles within Medium Risk ]]+Table47[[#This Row],[Miles within Low Risk]])*LiningRate*yield_pipe","v":0},{"$f":"(Table47[[#This Row],[Miles within High Risk]]+Table47[[#This Row],[Miles within Medium Risk ]]+Table47[[#This Row],[Miles within Low Risk]])*ReplacementRate*yield_pipe","v":0},{"$f":"SUM(Table47[[#This Row],[Miles Estimated For Repair]:[Miles Estimated for Replacement]])","v":0},{"$f":"SUMIFS(Table3[Replacement Cost],Table3[Material, select from list],\"=\"&A10,Table3[Total Risk],\">=0\" )*RepairRate*RepairPctUC*yield_pipe","v":0},{"$f":"SUMIFS(Table3[Replacement Cost],Table3[Material, select from list],\"=\"&A10,Table3[Total Risk],\">=0\" )*LiningRate*LiningPctUC*yield_pipe","v":0},{"$f":"SUMIFS(Table3[Replacement Cost],Table3[Material, select from list],\"=\"&A10,Table3[Total Risk],\">=0\" )*ReplacementRate*ReplacementPctUC*yield_pipe","v":0},{"$f":"K10+L10+M10","v":0}]
["Unknown",{"$f":"(SUMIF(Table3[Material, select from list],\"=\"&A11,Table3[LengthMiles]))/SUM(Table3[LengthMiles])","v":{"$error":"#DIV/0!"}},{"$f":"(SUMIF(Table3[Material, select from list],\"=\"&A11,Table3[LengthMiles]))","v":0},{"$f":"(SUMIFS(Table3[LengthMiles],Table3[Material, select from list],\"=\"&A11,Table3[Total Risk],\"<=\" &LowRiskBreak))","v":0},{"$f":"(SUMIFS(Table3[LengthMiles],Table3[Material, select from list],\"=\"&A11,Table3[Total Risk],\"<\" &HighRiskBreak,Table3[Total Risk],\">=\" &LowRiskBreak))","v":0},{"$f":"(SUMIFS(Table3[LengthMiles],Table3[Material, select from list],\"=\"&A11,Table3[Total Risk],\">=\" &HighRiskBreak))","v":0},{"$f":"(Table47[[#This Row],[Miles within High Risk]]+Table47[[#This Row],[Miles within Medium Risk ]]+Table47[[#This Row],[Miles within Low Risk]])*RepairRate*yield_pipe","v":0},{"$f":"(Table47[[#This Row],[Miles within High Risk]]+Table47[[#This Row],[Miles within Medium Risk ]]+Table47[[#This Row],[Miles within Low Risk]])*LiningRate*yield_pipe","v":0},{"$f":"(Table47[[#This Row],[Miles within High Risk]]+Table47[[#This Row],[Miles within Medium Risk ]]+Table47[[#This Row],[Miles within Low Risk]])*ReplacementRate*yield_pipe","v":0},{"$f":"SUM(Table47[[#This Row],[Miles Estimated For Repair]:[Miles Estimated for Replacement]])","v":0},{"$f":"SUMIFS(Table3[Replacement Cost],Table3[Material, select from list],\"=\"&A11,Table3[Total Risk],\">=0\" )*RepairRate*RepairPctUC*yield_pipe","v":0},{"$f":"SUMIFS(Table3[Replacement Cost],Table3[Material, select from list],\"=\"&A11,Table3[Total Risk],\">=0\" )*LiningRate*LiningPctUC*yield_pipe","v":0},{"$f":"SUMIFS(Table3[Replacement Cost],Table3[Material, select from list],\"=\"&A11,Table3[Total Risk],\">=0\" )*ReplacementRate*ReplacementPctUC*yield_pipe","v":0},{"$f":"K11+L11+M11","v":0}]
["Total",{"$f":"SUM(B8:B11)","v":{"$error":"#DIV/0!"}},{"$f":"SUM(C8:C11)","v":0},{"$f":"SUM(D8:D11)","v":0},0,{"$f":"SUM(F8:F11)","v":0},{"$f":"(Table47[[#This Row],[Miles within High Risk]]+Table47[[#This Row],[Miles within Medium Risk ]]+Table47[[#This Row],[Miles within Low Risk]])*('Model Selection and Inputs'!$B$10)*'Model Selection and Inputs'!$B$13","v":0},{"$f":"SUM(H8:H11)","v":0},0,0,0,0,0,0]
[]
[null,null,null,null,null,null,null,null,{"$f":"J12/C12","v":{"$error":"#DIV/0!"}},null,"`"]
[]
["Manhole Data"]
["Manhole Type","System Count","Count within Low Risk ","Count within Medium Risk","Count within High Risk","Count Estimated for Repair","Count Estimated for Lining","Count Estimated for Replacement","Count Estimated for Rehabilitation","Estimated Repair Cost","Total Estimated Lining Cost","Estimated Replacement Cost","Total Estimated Rehabilitation Costs"]
["Brick",{"$f":"(COUNTIF(TableMH[Material, select from list],\"=\"&A18))","v":0},{"$f":"(COUNTIFS(TableMH[Material, select from list],\"=\"&Table58[[#This Row],[Manhole Type]],TableMH[Total Risk],\"<=\" &$B$4))","v":0},{"$f":"(COUNTIFS(TableMH[Material, select from list],\"=\"&Table58[[#This Row],[Manhole Type]],TableMH[Total Risk],\"<=\" &$B$3,TableMH[Total Risk],\">\" &$B$4))","v":0},{"$f":"(COUNTIFS(TableMH[Material, select from list],\"=\"&Table58[[#This Row],[Manhole Type]],TableMH[Total Risk],\">=\" &$B$2))","v":0},{"$f":"(B18*'Model Selection and Inputs'!$E$10)*'Model Selection and Inputs'!$E$13","v":0},{"$f":"(B18*'Model Selection and Inputs'!$E$10)*'Model Selection and Inputs'!$E$11","v":0},{"$f":"(B18*'Model Selection and Inputs'!$E$10)*'Model Selection and Inputs'!$E$12","v":0},{"$f":"SUM(Table58[[#This Row],[Count Estimated for Repair]:[Count Estimated for Replacement]])","v":0},{"$f":"(((SUMIFS(TableMH[Repair Cost],TableMH[Material, select from list],\"=\"&Table58[[#This Row],[Manhole Type]],TableMH[Total Risk],\">=0\" )))*'Model Selection and Inputs'!$E$10)*'Model Selection and Inputs'!$E$13","v":0},{"$f":"(((SUMIFS(TableMH[Lining Cost],TableMH[Material, select from list],\"=\"&Table58[[#This Row],[Manhole Type]],TableMH[Total Risk],\">=0\" )))*'Model Selection and Inputs'!$E$10)*'Model Selection and Inputs'!$E$11","v":0},{"$f":"(((SUMIFS(TableMH[Replacement Cost],TableMH[Material, select from list],\"=\"&Table58[[#This Row],[Manhole Type]],TableMH[Total Risk],\">=0\" )))*'Model Selection and Inputs'!$E$10)*'Model Selection and Inputs'!$E$12","v":0},{"$f":"SUM(J18:L18)","v":0}]
["Precast Concrete",{"$f":"(COUNTIF(TableMH[Material, select from list],\"=\"&A19))","v":0},{"$f":"(COUNTIFS(TableMH[Material, select from list],\"=\"&Table58[[#This Row],[Manhole Type]],TableMH[Total Risk],\"<=\" &$B$4))","v":0},{"$f":"(COUNTIFS(TableMH[Material, select from list],\"=\"&Table58[[#This Row],[Manhole Type]],TableMH[Total Risk],\"<=\" &$B$3,TableMH[Total Risk],\">\" &$B$4))","v":0},{"$f":"(COUNTIFS(TableMH[Material, select from list],\"=\"&Table58[[#This Row],[Manhole Type]],TableMH[Total Risk],\">=\" &$B$2))","v":0},{"$f":"(B19*'Model Selection and Inputs'!$E$10)*'Model Selection and Inputs'!$E$13","v":0},{"$f":"(B19*'Model Selection and Inputs'!$E$10)*'Model Selection and Inputs'!$E$11","v":0},{"$f":"(B19*'Model Selection and Inputs'!$E$10)*'Model Selection and Inputs'!$E$12","v":0},{"$f":"SUM(Table58[[#This Row],[Count Estimated for Repair]:[Count Estimated for Replacement]])","v":0},{"$f":"(((SUMIFS(TableMH[Repair Cost],TableMH[Material, select from list],\"=\"&Table58[[#This Row],[Manhole Type]],TableMH[Total Risk],\">=0\" )))*'Model Selection and Inputs'!$E$10)*'Model Selection and Inputs'!$E$13","v":0},{"$f":"(((SUMIFS(TableMH[Lining Cost],TableMH[Material, select from list],\"=\"&Table58[[#This Row],[Manhole Type]],TableMH[Total Risk],\">=0\" )))*'Model Selection and Inputs'!$E$10)*'Model Selection and Inputs'!$E$11","v":0},{"$f":"(((SUMIFS(TableMH[Replacement Cost],TableMH[Material, select from list],\"=\"&Table58[[#This Row],[Manhole Type]],TableMH[Total Risk],\">=0\" )))*'Model Selection and Inputs'!$E$10)*'Model Selection and Inputs'!$E$12","v":0},{"$f":"SUM(J19:L19)","v":0}]
["Plastic/Fiberglass",{"$f":"(COUNTIF(TableMH[Material, select from list],\"=\"&A20))","v":0},{"$f":"(COUNTIFS(TableMH[Material, select from list],\"=\"&Table58[[#This Row],[Manhole Type]],TableMH[Total Risk],\"<=\" &$B$4))","v":0},{"$f":"(COUNTIFS(TableMH[Material, select from list],\"=\"&Table58[[#This Row],[Manhole Type]],TableMH[Total Risk],\"<=\" &$B$3,TableMH[Total Risk],\">\" &$B$4))","v":0},{"$f":"(COUNTIFS(TableMH[Material, select from list],\"=\"&Table58[[#This Row],[Manhole Type]],TableMH[Total Risk],\">=\" &$B$2))","v":0},{"$f":"(B20*'Model Selection and Inputs'!$E$10)*'Model Selection and Inputs'!$E$13","v":0},{"$f":"(B20*'Model Selection and Inputs'!$E$10)*'Model Selection and Inputs'!$E$11","v":0},{"$f":"(B20*'Model Selection and Inputs'!$E$10)*'Model Selection and Inputs'!$E$12","v":0},{"$f":"SUM(Table58[[#This Row],[Count Estimated for Repair]:[Count Estimated for Replacement]])","v":0},{"$f":"(((SUMIFS(TableMH[Repair Cost],TableMH[Material, select from list],\"=\"&Table58[[#This Row],[Manhole Type]],TableMH[Total Risk],\">=0\" )))*'Model Selection and Inputs'!$E$10)*'Model Selection and Inputs'!$E$13","v":0},{"$f":"(((SUMIFS(TableMH[Lining Cost],TableMH[Material, select from list],\"=\"&Table58[[#This Row],[Manhole Type]],TableMH[Total Risk],\">=0\" )))*'Model Selection and Inputs'!$E$10)*'Model Selection and Inputs'!$E$11","v":0},{"$f":"(((SUMIFS(TableMH[Replacement Cost],TableMH[Material, select from list],\"=\"&Table58[[#This Row],[Manhole Type]],TableMH[Total Risk],\">=0\" )))*'Model Selection and Inputs'!$E$10)*'Model Selection and Inputs'!$E$12","v":0},{"$f":"SUM(J20:L20)","v":0}]
["Other",{"$f":"(COUNTIF(TableMH[Material, select from list],\"=\"&A21))","v":0},{"$f":"(COUNTIFS(TableMH[Material, select from list],\"=\"&Table58[[#This Row],[Manhole Type]],TableMH[Total Risk],\"<=\" &$B$4))","v":0},{"$f":"(COUNTIFS(TableMH[Material, select from list],\"=\"&Table58[[#This Row],[Manhole Type]],TableMH[Total Risk],\"<=\" &$B$3,TableMH[Total Risk],\">\" &$B$4))","v":0},{"$f":"(COUNTIFS(TableMH[Material, select from list],\"=\"&Table58[[#This Row],[Manhole Type]],TableMH[Total Risk],\">=\" &$B$2))","v":0},{"$f":"(B21*'Model Selection and Inputs'!$E$10)*'Model Selection and Inputs'!$E$13","v":0},{"$f":"(B21*'Model Selection and Inputs'!$E$10)*'Model Selection and Inputs'!$E$11","v":0},{"$f":"(B21*'Model Selection and Inputs'!$E$10)*'Model Selection and Inputs'!$E$12","v":0},{"$f":"SUM(Table58[[#This Row],[Count Estimated for Repair]:[Count Estimated for Replacement]])","v":0},{"$f":"(((SUMIFS(TableMH[Repair Cost],TableMH[Material, select from list],\"=\"&Table58[[#This Row],[Manhole Type]],TableMH[Total Risk],\">=0\" )))*'Model Selection and Inputs'!$E$10)*'Model Selection and Inputs'!$E$13","v":0},{"$f":"(((SUMIFS(TableMH[Lining Cost],TableMH[Material, select from list],\"=\"&Table58[[#This Row],[Manhole Type]],TableMH[Total Risk],\">=0\" )))*'Model Selection and Inputs'!$E$10)*'Model Selection and Inputs'!$E$11","v":0},{"$f":"(((SUMIFS(TableMH[Replacement Cost],TableMH[Material, select from list],\"=\"&Table58[[#This Row],[Manhole Type]],TableMH[Total Risk],\">=0\" )))*'Model Selection and Inputs'!$E$10)*'Model Selection and Inputs'!$E$12","v":0},{"$f":"SUM(J21:L21)","v":0}]
["Total",{"$f":"SUM(B18:B21)","v":0},{"$f":"SUM(C18:C21)","v":0},{"$f":"SUM(D18:D21)","v":0},{"$f":"SUM(E18:E21)","v":0},{"$f":"SUM(F18:F21)","v":0},{"$f":"SUM(G18:G21)","v":0},0,0,{"$f":"SUM(J18:J21)","v":0},{"$f":"SUM(K18:K21)","v":0},{"$f":"SUM(L18:L21)","v":0},{"$f":"SUM(M18:M21)","v":0}]
[]
[]
[]
[]
["Total Collection System Data",null,15728403.708900001,11728403.708900001,0.74568302835865163]
[{"$f":"\"Planning Period Estimates (Costs Escalated \" & TEXT(Annual_Inflation,\"##0.00%\") & \" per year)\"","v":"Planning Period Estimates (Costs Escalated 2.50% per year)"}]
["Total Planning Horizon (yrs):",{"$f":"'Model Selection and Inputs'!E4","v":20},"End Year","Miles Estimated for Repair","Miles Estimated for Lining ","Miles Estimated for Replacement","Miles Estimated For Rehabilitation","Total Estimated Repair Costs","Total Estimated Lining Costs","Total Estimated Replacement Costs","Total Estimated Rehabilitation Costs","Total Estimated Manhole Costs","Cumulative Repair Cost","Cumulative Lining Cost","Cumulative Replacement Cost","CumulativeTotal Rehabiliation Cost","Accumulated Manhole Cost"]
["First Year of Planning Period:",{"$f":"First_Year_of_Planning_Period","v":2022}]
["End Planning Year:",{"$f":"B30+Total_Planning_Period","v":2042}]
["Number of Periods:",5]
["Planning Years","Begin Year",{"$f":"C29","v":"End Year"},"Miles Estimated for Repair","Miles Estimated for Lining ","Miles Estimated for Replacement","Miles Estimated For Rehabilitation","Total Estimated Repair Costs","Total Estimated Lining Costs","Total Estimated Replacement Costs","Total Estimated Rehabilitation Costs","Total Estimated Manhole Costs","Cumulative Repair Cost","Cumulative Lining Cost","Cumulative Replacement Cost","CumulativeTotal Rehabiliation Cost"]
[]
[{"$f":"IF(ISNUMBER(C35),(CONCATENATE(B35,\"-\",C35)),\"\")","v":"2022-2026"},{"$f":"B30","v":2022},{"$f":"IFERROR(IF(B35+Total_Planning_Period/Number_of_Periods<=End_Planning_Year,B35+Total_Planning_Period/Number_of_Periods,\"\"),\"\")","v":2026},{"$f":"IF(C35<=End_Planning_Year,MAX(Table47[Miles Estimated For Repair])/Number_of_Periods,\"\")","v":0},{"$f":"IF(C35<=End_Planning_Year,MAX(Table47[[Miles Estimated for Lining ]])/Number_of_Periods,\"\")","v":0},{"$f":"IF(C35<=End_Planning_Year,MAX(Table47[Miles Estimated for Replacement])/Number_of_Periods,\"\")","v":0},{"$f":"IF(C35<=End_Planning_Year,MAX(Table47[Miles Estimated For Rehabilitation])/Number_of_Periods,\"\")","v":0},{"$f":"IFERROR(IF(C35<=End_Planning_Year,MAX(Table47[Estimated Repair Costs])/Number_of_Periods,\"\")*S35,\"\")","v":0},{"$f":"IFERROR(IF(C35<=End_Planning_Year,MAX(Table47[Total Estimated Lining Costs])/Number_of_Periods,\"\")*S35,\"\")","v":0},{"$f":"IFERROR(IF(C35<=End_Planning_Year,MAX(Table47[Total Estimated Replacement Costs])/Number_of_Periods,\"\")*S35,\"\")","v":0},{"$f":"IFERROR(IF(C35<=End_Planning_Year,$N$12/Number_of_Periods,\"\")*S35,\"\")","v":0},{"$f":"IFERROR(IF(C35<=End_Planning_Year,SUM(Table58[Total Estimated Rehabilitation Costs])/Number_of_Periods,\"\")*S35,\"\")","v":0},{"$f":"IFERROR($H35,\"\")","v":0},{"$f":"IFERROR(I35,\"\")","v":0},{"$f":"IFERROR(J35,\"\")","v":0},{"$f":"IFERROR(K35+L35,\"\")","v":0},{"$f":"IFERROR(L35,\"\")","v":0},null,{"$f":"IFERROR(AVERAGEIFS(tblEscalation[FACTOR],tblEscalation[YEAR],\">=\" &B35,tblEscalation[YEAR],\"<=\" &C35-1),0)","v":1.0510254119866067}]
["2026-2030",{"$f":"IF(C35<$B$31,C35,\"\")","v":2026},2030,{"$f":"IF(C36<=End_Planning_Year,MAX(Table47[Miles Estimated For Repair])/Number_of_Periods,\"\")","v":0},{"$f":"IF(C36<=End_Planning_Year,MAX(Table47[[Miles Estimated for Lining ]])/Number_of_Periods,\"\")","v":0},{"$f":"IF(C36<=End_Planning_Year,MAX(Table47[Miles Estimated for Replacement])/Number_of_Periods,\"\")","v":0},{"$f":"IF(C36<=End_Planning_Year,MAX(Table47[Miles Estimated For Rehabilitation])/Number_of_Periods,\"\")","v":0},{"$f":"IFERROR(IF(C36<=End_Planning_Year,MAX(Table47[Estimated Repair Costs])/Number_of_Periods,\"\")*S36,\"\")","v":0},{"$f":"IFERROR(IF(C36<=End_Planning_Year,MAX(Table47[Total Estimated Lining Costs])/Number_of_Periods,\"\")*S36,\"\")","v":0},{"$f":"IFERROR(IF(C36<=End_Planning_Year,MAX(Table47[Total Estimated Replacement Costs])/Number_of_Periods,\"\")*S36,\"\")","v":0},0,{"$f":"IFERROR(IF(C36<=End_Planning_Year,SUM(Table58[Total Estimated Rehabilitation Costs])/Number_of_Periods,\"\")*S36,\"\")","v":0},{"$f":"IFERROR(M35+H36,\"\")","v":0},{"$f":"IFERROR(N35+(I36),\"\")","v":0},{"$f":"IFERROR(O35+(J36),\"\")","v":0},{"$f":"IFERROR(P35+K36+L36,\"\")","v":0},{"$f":"IFERROR(L36+Q35,\"\")","v":0},null,{"$f":"IFERROR(AVERAGEIFS(tblEscalation[FACTOR],tblEscalation[YEAR],\">=\" &B36,tblEscalation[YEAR],\"<=\" &C36-1),0)","v":1.1601353981252673}]
["2030-2034",2030,2034,{"$f":"IF(C37<=End_Planning_Year,MAX(Table47[Miles Estimated For Repair])/Number_of_Periods,\"\")","v":0},{"$f":"IF(C37<=End_Planning_Year,MAX(Table47[[Miles Estimated for Lining ]])/Number_of_Periods,\"\")","v":0},{"$f":"IF(C37<=End_Planning_Year,MAX(Table47[Miles Estimated for Replacement])/Number_of_Periods,\"\")","v":0},{"$f":"IF(C37<=End_Planning_Year,MAX(Table47[Miles Estimated For Rehabilitation])/Number_of_Periods,\"\")","v":0},{"$f":"IFERROR(IF(C37<=End_Planning_Year,MAX(Table47[Estimated Repair Costs])/Number_of_Periods,\"\")*S37,\"\")","v":0},{"$f":"IFERROR(IF(C37<=End_Planning_Year,MAX(Table47[Total Estimated Lining Costs])/Number_of_Periods,\"\")*S37,\"\")","v":0},{"$f":"IFERROR(IF(C37<=End_Planning_Year,MAX(Table47[Total Estimated Replacement Costs])/Number_of_Periods,\"\")*S37,\"\")","v":0},0,{"$f":"IFERROR(IF(C37<=End_Planning_Year,SUM(Table58[Total Estimated Rehabilitation Costs])/Number_of_Periods,\"\")*S37,\"\")","v":0},0,0,0,0,0,null,{"$f":"IFERROR(AVERAGEIFS(tblEscalation[FACTOR],tblEscalation[YEAR],\">=\" &B37,tblEscalation[YEAR],\"<=\" &C37-1),0)","v":1.2805724073210363}]
["2034-2038",2034,2038,{"$f":"IF(C38<=End_Planning_Year,MAX(Table47[Miles Estimated For Repair])/Number_of_Periods,\"\")","v":0},{"$f":"IF(C38<=End_Planning_Year,MAX(Table47[[Miles Estimated for Lining ]])/Number_of_Periods,\"\")","v":0},{"$f":"IF(C38<=End_Planning_Year,MAX(Table47[Miles Estimated for Replacement])/Number_of_Periods,\"\")","v":0},{"$f":"IF(C38<=End_Planning_Year,MAX(Table47[Miles Estimated For Rehabilitation])/Number_of_Periods,\"\")","v":0},{"$f":"IFERROR(IF(C38<=End_Planning_Year,MAX(Table47[Estimated Repair Costs])/Number_of_Periods,\"\")*S38,\"\")","v":0},{"$f":"IFERROR(IF(C38<=End_Planning_Year,MAX(Table47[Total Estimated Lining Costs])/Number_of_Periods,\"\")*S38,\"\")","v":0},{"$f":"IFERROR(IF(C38<=End_Planning_Year,MAX(Table47[Total Estimated Replacement Costs])/Number_of_Periods,\"\")*S38,\"\")","v":0},0,{"$f":"IFERROR(IF(C38<=End_Planning_Year,SUM(Table58[Total Estimated Rehabilitation Costs])/Number_of_Periods,\"\")*S38,\"\")","v":0},0,0,0,0,0,null,{"$f":"IFERROR(AVERAGEIFS(tblEscalation[FACTOR],tblEscalation[YEAR],\">=\" &B38,tblEscalation[YEAR],\"<=\" &C38-1),0)","v":1.4135123305796475}]
["2038-2042",2038,2042,{"$f":"IF(C39<=End_Planning_Year,MAX(Table47[Miles Estimated For Repair])/Number_of_Periods,\"\")","v":0},{"$f":"IF(C39<=End_Planning_Year,MAX(Table47[[Miles Estimated for Lining ]])/Number_of_Periods,\"\")","v":0},{"$f":"IF(C39<=End_Planning_Year,MAX(Table47[Miles Estimated for Replacement])/Number_of_Periods,\"\")","v":0},{"$f":"IF(C39<=End_Planning_Year,MAX(Table47[Miles Estimated For Rehabilitation])/Number_of_Periods,\"\")","v":0},{"$f":"IFERROR(IF(C39<=End_Planning_Year,MAX(Table47[Estimated Repair Costs])/Number_of_Periods,\"\")*S39,\"\")","v":0},{"$f":"IFERROR(IF(C39<=End_Planning_Year,MAX(Table47[Total Estimated Lining Costs])/Number_of_Periods,\"\")*S39,\"\")","v":0},{"$f":"IFERROR(IF(C39<=End_Planning_Year,MAX(Table47[Total Estimated Replacement Costs])/Number_of_Periods,\"\")*S39,\"\")","v":0},0,{"$f":"IFERROR(IF(C39<=End_Planning_Year,SUM(Table58[Total Estimated Rehabilitation Costs])/Number_of_Periods,\"\")*S39,\"\")","v":0},0,0,0,0,0,null,{"$f":"IFERROR(AVERAGEIFS(tblEscalation[FACTOR],tblEscalation[YEAR],\">=\" &B39,tblEscalation[YEAR],\"<=\" &C39-1),0)","v":1.5602531315512005}]
["","","",{"$f":"IF(C40<=End_Planning_Year,MAX(Table47[Miles Estimated For Repair])/Number_of_Periods,\"\")","v":""},{"$f":"IF(C40<=End_Planning_Year,MAX(Table47[[Miles Estimated for Lining ]])/Number_of_Periods,\"\")","v":""},{"$f":"IF(C40<=End_Planning_Year,MAX(Table47[Miles Estimated for Replacement])/Number_of_Periods,\"\")","v":""},{"$f":"IF(C40<=End_Planning_Year,MAX(Table47[Miles Estimated For Rehabilitation])/Number_of_Periods,\"\")","v":""},{"$f":"IFERROR(IF(C40<=End_Planning_Year,MAX(Table47[Estimated Repair Costs])/Number_of_Periods,\"\")*S40,\"\")","v":""},{"$f":"IFERROR(IF(C40<=End_Planning_Year,MAX(Table47[Total Estimated Lining Costs])/Number_of_Periods,\"\")*S40,\"\")","v":""},{"$f":"IFERROR(IF(C40<=End_Planning_Year,MAX(Table47[Total Estimated Replacement Costs])/Number_of_Periods,\"\")*S40,\"\")","v":""},"",{"$f":"IFERROR(IF(C40<=End_Planning_Year,SUM(Table58[Total Estimated Rehabilitation Costs])/Number_of_Periods,\"\")*S40,\"\")","v":""},"","","","","",null,{"$f":"IFERROR(AVERAGEIFS(tblEscalation[FACTOR],tblEscalation[YEAR],\">=\" &B40,tblEscalation[YEAR],\"<=\" &C40-1),0)","v":0}]
["","","",{"$f":"IF(C41<=End_Planning_Year,MAX(Table47[Miles Estimated For Repair])/Number_of_Periods,\"\")","v":""},{"$f":"IF(C41<=End_Planning_Year,MAX(Table47[[Miles Estimated for Lining ]])/Number_of_Periods,\"\")","v":""},{"$f":"IF(C41<=End_Planning_Year,MAX(Table47[Miles Estimated for Replacement])/Number_of_Periods,\"\")","v":""},{"$f":"IF(C41<=End_Planning_Year,MAX(Table47[Miles Estimated For Rehabilitation])/Number_of_Periods,\"\")","v":""},{"$f":"IFERROR(IF(C41<=End_Planning_Year,MAX(Table47[Estimated Repair Costs])/Number_of_Periods,\"\")*S41,\"\")","v":""},{"$f":"IFERROR(IF(C41<=End_Planning_Year,MAX(Table47[Total Estimated Lining Costs])/Number_of_Periods,\"\")*S41,\"\")","v":""},{"$f":"IFERROR(IF(C41<=End_Planning_Year,MAX(Table47[Total Estimated Replacement Costs])/Number_of_Periods,\"\")*S41,\"\")","v":""},"",{"$f":"IFERROR(IF(C41<=End_Planning_Year,SUM(Table58[Total Estimated Rehabilitation Costs])/Number_of_Periods,\"\")*S41,\"\")","v":""},"","","","","",null,{"$f":"IFERROR(AVERAGEIFS(tblEscalation[FACTOR],tblEscalation[YEAR],\">=\" &B41,tblEscalation[YEAR],\"<=\" &C41-1),0)","v":0}]
["","","",{"$f":"IF(C42<=End_Planning_Year,MAX(Table47[Miles Estimated For Repair])/Number_of_Periods,\"\")","v":""},{"$f":"IF(C42<=End_Planning_Year,MAX(Table47[[Miles Estimated for Lining ]])/Number_of_Periods,\"\")","v":""},{"$f":"IF(C42<=End_Planning_Year,MAX(Table47[Miles Estimated for Replacement])/Number_of_Periods,\"\")","v":""},{"$f":"IF(C42<=End_Planning_Year,MAX(Table47[Miles Estimated For Rehabilitation])/Number_of_Periods,\"\")","v":""},{"$f":"IFERROR(IF(C42<=End_Planning_Year,MAX(Table47[Estimated Repair Costs])/Number_of_Periods,\"\")*S42,\"\")","v":""},{"$f":"IFERROR(IF(C42<=End_Planning_Year,MAX(Table47[Total Estimated Lining Costs])/Number_of_Periods,\"\")*S42,\"\")","v":""},{"$f":"IFERROR(IF(C42<=End_Planning_Year,MAX(Table47[Total Estimated Replacement Costs])/Number_of_Periods,\"\")*S42,\"\")","v":""},"",{"$f":"IFERROR(IF(C42<=End_Planning_Year,SUM(Table58[Total Estimated Rehabilitation Costs])/Number_of_Periods,\"\")*S42,\"\")","v":""},"","","","","",null,{"$f":"IFERROR(AVERAGEIFS(tblEscalation[FACTOR],tblEscalation[YEAR],\">=\" &B42,tblEscalation[YEAR],\"<=\" &C42-1),0)","v":0}]
["","","",{"$f":"IF(C43<=End_Planning_Year,MAX(Table47[Miles Estimated For Repair])/Number_of_Periods,\"\")","v":""},{"$f":"IF(C43<=End_Planning_Year,MAX(Table47[[Miles Estimated for Lining ]])/Number_of_Periods,\"\")","v":""},{"$f":"IF(C43<=End_Planning_Year,MAX(Table47[Miles Estimated for Replacement])/Number_of_Periods,\"\")","v":""},{"$f":"IF(C43<=End_Planning_Year,MAX(Table47[Miles Estimated For Rehabilitation])/Number_of_Periods,\"\")","v":""},{"$f":"IFERROR(IF(C43<=End_Planning_Year,MAX(Table47[Estimated Repair Costs])/Number_of_Periods,\"\")*S43,\"\")","v":""},{"$f":"IFERROR(IF(C43<=End_Planning_Year,MAX(Table47[Total Estimated Lining Costs])/Number_of_Periods,\"\")*S43,\"\")","v":""},{"$f":"IFERROR(IF(C43<=End_Planning_Year,MAX(Table47[Total Estimated Replacement Costs])/Number_of_Periods,\"\")*S43,\"\")","v":""},"",{"$f":"IFERROR(IF(C43<=End_Planning_Year,SUM(Table58[Total Estimated Rehabilitation Costs])/Number_of_Periods,\"\")*S43,\"\")","v":""},"","","","","",null,{"$f":"IFERROR(AVERAGEIFS(tblEscalation[FACTOR],tblEscalation[YEAR],\">=\" &B43,tblEscalation[YEAR],\"<=\" &C43-1),0)","v":0}]
["","","",{"$f":"IF(C44<=End_Planning_Year,MAX(Table47[Miles Estimated For Repair])/Number_of_Periods,\"\")","v":""},{"$f":"IF(C44<=End_Planning_Year,MAX(Table47[[Miles Estimated for Lining ]])/Number_of_Periods,\"\")","v":""},{"$f":"IF(C44<=End_Planning_Year,MAX(Table47[Miles Estimated for Replacement])/Number_of_Periods,\"\")","v":""},{"$f":"IF(C44<=End_Planning_Year,MAX(Table47[Miles Estimated For Rehabilitation])/Number_of_Periods,\"\")","v":""},{"$f":"IFERROR(IF(C44<=End_Planning_Year,MAX(Table47[Estimated Repair Costs])/Number_of_Periods,\"\")*S44,\"\")","v":""},{"$f":"IFERROR(IF(C44<=End_Planning_Year,MAX(Table47[Total Estimated Lining Costs])/Number_of_Periods,\"\")*S44,\"\")","v":""},{"$f":"IFERROR(IF(C44<=End_Planning_Year,MAX(Table47[Total Estimated Replacement Costs])/Number_of_Periods,\"\")*S44,\"\")","v":""},"",{"$f":"IFERROR(IF(C44<=End_Planning_Year,SUM(Table58[Total Estimated Rehabilitation Costs])/Number_of_Periods,\"\")*S44,\"\")","v":""},"","","","","",null,{"$f":"IFERROR(AVERAGEIFS(tblEscalation[FACTOR],tblEscalation[YEAR],\">=\" &B44,tblEscalation[YEAR],\"<=\" &C44-1),0)","v":0}]
["","","",{"$f":"IF(C45<=End_Planning_Year,MAX(Table47[Miles Estimated For Repair])/Number_of_Periods,\"\")","v":""},{"$f":"IF(C45<=End_Planning_Year,MAX(Table47[[Miles Estimated for Lining ]])/Number_of_Periods,\"\")","v":""},{"$f":"IF(C45<=End_Planning_Year,MAX(Table47[Miles Estimated for Replacement])/Number_of_Periods,\"\")","v":""},{"$f":"IF(C45<=End_Planning_Year,MAX(Table47[Miles Estimated For Rehabilitation])/Number_of_Periods,\"\")","v":""},{"$f":"IFERROR(IF(C45<=End_Planning_Year,MAX(Table47[Estimated Repair Costs])/Number_of_Periods,\"\")*S45,\"\")","v":""},{"$f":"IFERROR(IF(C45<=End_Planning_Year,MAX(Table47[Total Estimated Lining Costs])/Number_of_Periods,\"\")*S45,\"\")","v":""},{"$f":"IFERROR(IF(C45<=End_Planning_Year,MAX(Table47[Total Estimated Replacement Costs])/Number_of_Periods,\"\")*S45,\"\")","v":""},"",{"$f":"IFERROR(IF(C45<=End_Planning_Year,SUM(Table58[Total Estimated Rehabilitation Costs])/Number_of_Periods,\"\")*S45,\"\")","v":""},"","","","","",null,{"$f":"IFERROR(AVERAGEIFS(tblEscalation[FACTOR],tblEscalation[YEAR],\">=\" &B45,tblEscalation[YEAR],\"<=\" &C45-1),0)","v":0}]
["","","",{"$f":"IF(C46<=End_Planning_Year,MAX(Table47[Miles Estimated For Repair])/Number_of_Periods,\"\")","v":""},{"$f":"IF(C46<=End_Planning_Year,MAX(Table47[[Miles Estimated for Lining ]])/Number_of_Periods,\"\")","v":""},{"$f":"IF(C46<=End_Planning_Year,MAX(Table47[Miles Estimated for Replacement])/Number_of_Periods,\"\")","v":""},{"$f":"IF(C46<=End_Planning_Year,MAX(Table47[Miles Estimated For Rehabilitation])/Number_of_Periods,\"\")","v":""},{"$f":"IFERROR(IF(C46<=End_Planning_Year,MAX(Table47[Estimated Repair Costs])/Number_of_Periods,\"\")*S46,\"\")","v":""},{"$f":"IFERROR(IF(C46<=End_Planning_Year,MAX(Table47[Total Estimated Lining Costs])/Number_of_Periods,\"\")*S46,\"\")","v":""},{"$f":"IFERROR(IF(C46<=End_Planning_Year,MAX(Table47[Total Estimated Replacement Costs])/Number_of_Periods,\"\")*S46,\"\")","v":""},"",{"$f":"IFERROR(IF(C46<=End_Planning_Year,SUM(Table58[Total Estimated Rehabilitation Costs])/Number_of_Periods,\"\")*S46,\"\")","v":""},"","","","","",null,{"$f":"IFERROR(AVERAGEIFS(tblEscalation[FACTOR],tblEscalation[YEAR],\">=\" &B46,tblEscalation[YEAR],\"<=\" &C46-1),0)","v":0}]
["","","",{"$f":"IF(C47<=End_Planning_Year,MAX(Table47[Miles Estimated For Repair])/Number_of_Periods,\"\")","v":""},{"$f":"IF(C47<=End_Planning_Year,MAX(Table47[[Miles Estimated for Lining ]])/Number_of_Periods,\"\")","v":""},{"$f":"IF(C47<=End_Planning_Year,MAX(Table47[Miles Estimated for Replacement])/Number_of_Periods,\"\")","v":""},{"$f":"IF(C47<=End_Planning_Year,MAX(Table47[Miles Estimated For Rehabilitation])/Number_of_Periods,\"\")","v":""},{"$f":"IFERROR(IF(C47<=End_Planning_Year,MAX(Table47[Estimated Repair Costs])/Number_of_Periods,\"\")*S47,\"\")","v":""},{"$f":"IFERROR(IF(C47<=End_Planning_Year,MAX(Table47[Total Estimated Lining Costs])/Number_of_Periods,\"\")*S47,\"\")","v":""},{"$f":"IFERROR(IF(C47<=End_Planning_Year,MAX(Table47[Total Estimated Replacement Costs])/Number_of_Periods,\"\")*S47,\"\")","v":""},"",{"$f":"IFERROR(IF(C47<=End_Planning_Year,SUM(Table58[Total Estimated Rehabilitation Costs])/Number_of_Periods,\"\")*S47,\"\")","v":""},"","","","","",null,{"$f":"IFERROR(AVERAGEIFS(tblEscalation[FACTOR],tblEscalation[YEAR],\">=\" &B47,tblEscalation[YEAR],\"<=\" &C47-1),0)","v":0}]
["","","",{"$f":"IF(C48<=End_Planning_Year,MAX(Table47[Miles Estimated For Repair])/Number_of_Periods,\"\")","v":""},{"$f":"IF(C48<=End_Planning_Year,MAX(Table47[[Miles Estimated for Lining ]])/Number_of_Periods,\"\")","v":""},{"$f":"IF(C48<=End_Planning_Year,MAX(Table47[Miles Estimated for Replacement])/Number_of_Periods,\"\")","v":""},{"$f":"IF(C48<=End_Planning_Year,MAX(Table47[Miles Estimated For Rehabilitation])/Number_of_Periods,\"\")","v":""},{"$f":"IFERROR(IF(C48<=End_Planning_Year,MAX(Table47[Estimated Repair Costs])/Number_of_Periods,\"\")*S48,\"\")","v":""},{"$f":"IFERROR(IF(C48<=End_Planning_Year,MAX(Table47[Total Estimated Lining Costs])/Number_of_Periods,\"\")*S48,\"\")","v":""},{"$f":"IFERROR(IF(C48<=End_Planning_Year,MAX(Table47[Total Estimated Replacement Costs])/Number_of_Periods,\"\")*S48,\"\")","v":""},"",{"$f":"IFERROR(IF(C48<=End_Planning_Year,SUM(Table58[Total Estimated Rehabilitation Costs])/Number_of_Periods,\"\")*S48,\"\")","v":""},"","","","","",null,{"$f":"IFERROR(AVERAGEIFS(tblEscalation[FACTOR],tblEscalation[YEAR],\">=\" &B48,tblEscalation[YEAR],\"<=\" &C48-1),0)","v":0}]
["","","",{"$f":"IF(C49<=End_Planning_Year,MAX(Table47[Miles Estimated For Repair])/Number_of_Periods,\"\")","v":""},{"$f":"IF(C49<=End_Planning_Year,MAX(Table47[[Miles Estimated for Lining ]])/Number_of_Periods,\"\")","v":""},{"$f":"IF(C49<=End_Planning_Year,MAX(Table47[Miles Estimated for Replacement])/Number_of_Periods,\"\")","v":""},{"$f":"IF(C49<=End_Planning_Year,MAX(Table47[Miles Estimated For Rehabilitation])/Number_of_Periods,\"\")","v":""},{"$f":"IFERROR(IF(C49<=End_Planning_Year,MAX(Table47[Estimated Repair Costs])/Number_of_Periods,\"\")*S49,\"\")","v":""},{"$f":"IFERROR(IF(C49<=End_Planning_Year,MAX(Table47[Total Estimated Lining Costs])/Number_of_Periods,\"\")*S49,\"\")","v":""},{"$f":"IFERROR(IF(C49<=End_Planning_Year,MAX(Table47[Total Estimated Replacement Costs])/Number_of_Periods,\"\")*S49,\"\")","v":""},"",{"$f":"IFERROR(IF(C49<=End_Planning_Year,SUM(Table58[Total Estimated Rehabilitation Costs])/Number_of_Periods,\"\")*S49,\"\")","v":""},"","","","","",null,{"$f":"IFERROR(AVERAGEIFS(tblEscalation[FACTOR],tblEscalation[YEAR],\">=\" &B49,tblEscalation[YEAR],\"<=\" &C49-1),0)","v":0}]
["","","",{"$f":"IF(C50<=End_Planning_Year,MAX(Table47[Miles Estimated For Repair])/Number_of_Periods,\"\")","v":""},{"$f":"IF(C50<=End_Planning_Year,MAX(Table47[[Miles Estimated for Lining ]])/Number_of_Periods,\"\")","v":""},{"$f":"IF(C50<=End_Planning_Year,MAX(Table47[Miles Estimated for Replacement])/Number_of_Periods,\"\")","v":""},{"$f":"IF(C50<=End_Planning_Year,MAX(Table47[Miles Estimated For Rehabilitation])/Number_of_Periods,\"\")","v":""},{"$f":"IFERROR(IF(C50<=End_Planning_Year,MAX(Table47[Estimated Repair Costs])/Number_of_Periods,\"\")*S50,\"\")","v":""},{"$f":"IFERROR(IF(C50<=End_Planning_Year,MAX(Table47[Total Estimated Lining Costs])/Number_of_Periods,\"\")*S50,\"\")","v":""},{"$f":"IFERROR(IF(C50<=End_Planning_Year,MAX(Table47[Total Estimated Replacement Costs])/Number_of_Periods,\"\")*S50,\"\")","v":""},"",{"$f":"IFERROR(IF(C50<=End_Planning_Year,SUM(Table58[Total Estimated Rehabilitation Costs])/Number_of_Periods,\"\")*S50,\"\")","v":""},"","","","","",null,{"$f":"IFERROR(AVERAGEIFS(tblEscalation[FACTOR],tblEscalation[YEAR],\">=\" &B50,tblEscalation[YEAR],\"<=\" &C50-1),0)","v":0}]
["","","",{"$f":"IF(C51<=End_Planning_Year,MAX(Table47[Miles Estimated For Repair])/Number_of_Periods,\"\")","v":""},{"$f":"IF(C51<=End_Planning_Year,MAX(Table47[[Miles Estimated for Lining ]])/Number_of_Periods,\"\")","v":""},{"$f":"IF(C51<=End_Planning_Year,MAX(Table47[Miles Estimated for Replacement])/Number_of_Periods,\"\")","v":""},{"$f":"IF(C51<=End_Planning_Year,MAX(Table47[Miles Estimated For Rehabilitation])/Number_of_Periods,\"\")","v":""},{"$f":"IFERROR(IF(C51<=End_Planning_Year,MAX(Table47[Estimated Repair Costs])/Number_of_Periods,\"\")*S51,\"\")","v":""},{"$f":"IFERROR(IF(C51<=End_Planning_Year,MAX(Table47[Total Estimated Lining Costs])/Number_of_Periods,\"\")*S51,\"\")","v":""},{"$f":"IFERROR(IF(C51<=End_Planning_Year,MAX(Table47[Total Estimated Replacement Costs])/Number_of_Periods,\"\")*S51,\"\")","v":""},"",{"$f":"IFERROR(IF(C51<=End_Planning_Year,SUM(Table58[Total Estimated Rehabilitation Costs])/Number_of_Periods,\"\")*S51,\"\")","v":""},"","","","","",null,{"$f":"IFERROR(AVERAGEIFS(tblEscalation[FACTOR],tblEscalation[YEAR],\">=\" &B51,tblEscalation[YEAR],\"<=\" &C51-1),0)","v":0}]
["","","",{"$f":"IF(C52<=End_Planning_Year,MAX(Table47[Miles Estimated For Repair])/Number_of_Periods,\"\")","v":""},{"$f":"IF(C52<=End_Planning_Year,MAX(Table47[[Miles Estimated for Lining ]])/Number_of_Periods,\"\")","v":""},{"$f":"IF(C52<=End_Planning_Year,MAX(Table47[Miles Estimated for Replacement])/Number_of_Periods,\"\")","v":""},{"$f":"IF(C52<=End_Planning_Year,MAX(Table47[Miles Estimated For Rehabilitation])/Number_of_Periods,\"\")","v":""},{"$f":"IFERROR(IF(C52<=End_Planning_Year,MAX(Table47[Estimated Repair Costs])/Number_of_Periods,\"\")*S52,\"\")","v":""},{"$f":"IFERROR(IF(C52<=End_Planning_Year,MAX(Table47[Total Estimated Lining Costs])/Number_of_Periods,\"\")*S52,\"\")","v":""},{"$f":"IFERROR(IF(C52<=End_Planning_Year,MAX(Table47[Total Estimated Replacement Costs])/Number_of_Periods,\"\")*S52,\"\")","v":""},"",{"$f":"IFERROR(IF(C52<=End_Planning_Year,SUM(Table58[Total Estimated Rehabilitation Costs])/Number_of_Periods,\"\")*S52,\"\")","v":""},"","","","","",null,{"$f":"IFERROR(AVERAGEIFS(tblEscalation[FACTOR],tblEscalation[YEAR],\">=\" &B52,tblEscalation[YEAR],\"<=\" &C52-1),0)","v":0}]
["","","",{"$f":"IF(C53<=End_Planning_Year,MAX(Table47[Miles Estimated For Repair])/Number_of_Periods,\"\")","v":""},{"$f":"IF(C53<=End_Planning_Year,MAX(Table47[[Miles Estimated for Lining ]])/Number_of_Periods,\"\")","v":""},{"$f":"IF(C53<=End_Planning_Year,MAX(Table47[Miles Estimated for Replacement])/Number_of_Periods,\"\")","v":""},{"$f":"IF(C53<=End_Planning_Year,MAX(Table47[Miles Estimated For Rehabilitation])/Number_of_Periods,\"\")","v":""},{"$f":"IFERROR(IF(C53<=End_Planning_Year,MAX(Table47[Estimated Repair Costs])/Number_of_Periods,\"\")*S53,\"\")","v":""},{"$f":"IFERROR(IF(C53<=End_Planning_Year,MAX(Table47[Total Estimated Lining Costs])/Number_of_Periods,\"\")*S53,\"\")","v":""},{"$f":"IFERROR(IF(C53<=End_Planning_Year,MAX(Table47[Total Estimated Replacement Costs])/Number_of_Periods,\"\")*S53,\"\")","v":""},"",{"$f":"IFERROR(IF(C53<=End_Planning_Year,SUM(Table58[Total Estimated Rehabilitation Costs])/Number_of_Periods,\"\")*S53,\"\")","v":""},"","","","","",null,{"$f":"IFERROR(AVERAGEIFS(tblEscalation[FACTOR],tblEscalation[YEAR],\">=\" &B53,tblEscalation[YEAR],\"<=\" &C53-1),0)","v":0}]

{"sheet":"Collection System Summary_Table","index":13,"n_rows":49,"n_cols":19,"rows_kept":49,"cut":false,"hidden":true,"merged":[[28,14,29,14],[28,15,29,15],[28,2,29,2],[28,3,29,3],[28,4,29,4],[28,5,29,5],[28,6,29,6],[28,7,29,7],[28,8,29,8],[28,9,29,9],[28,10,29,10],[28,11,29,11],[28,12,29,12],[28,13,29,13],[1,0,1,4],[23,0,23,16],[24,2,27,2],[24,3,27,3],[24,4,27,4],[24,5,27,5],[24,6,27,6],[24,7,27,7],[24,8,27,8],[24,14,27,14],[24,15,27,15],[24,16,27,16],[24,12,27,12],[24,13,27,13],[1,5,1,12],[28,0,29,0],[28,1,29,1],[24,9,27,9],[24,10,27,10],[24,11,27,11]]}
["Pipe Data"]
["System Estimates",null,null,null,null,"Total Mileage and Costs"]
["Pipe Material","% of Total System","System Mileage","Miles with Remaining Useful Life","Miles Beyond Useful Life","Miles Estimated for Repair","Miles Estimated for Lining ","Miles Estimated for Replacement","Miles Estimated For Rehabilitation","Estimated Repair Costs","Total Estimated Lining Costs","Total Estimated Replacement Costs","Total Estimated Rehabilitation Costs"]
["Non-Plastic",{"$f":"(SUMIF(Table3[Material, select from list],\"=\"&A4,Table3[LengthMiles]))/SUM(Table3[LengthMiles])","v":{"$error":"#DIV/0!"}},{"$f":"(SUMIF(Table3[Material, select from list],\"=\"&A4,Table3[LengthMiles]))","v":0},{"$f":"(SUMIFS(Table3[LengthMiles],Table3[Material, select from list],\"=\"&A4,Table3[YRS Beyond EUL],\"<0\" ))","v":0},{"$f":"(SUMIFS(Table3[LengthMiles],Table3[Material, select from list],\"=\"&A4,Table3[YRS Beyond EUL],\">=0\" ))","v":0},{"$f":"C4*yield_pipe*RepairRate","v":0},{"$f":"C4*LiningRate*yield_pipe","v":0},{"$f":"C4*yield_pipe*ReplacementRate","v":0},{"$f":"F4+G4+H4","v":0},{"$f":"(SUMIF(Table3[Material, select from list],\"=\"&A4,Table3[Replacement Cost]))*RepairRate*RepairPctUC*yield_pipe","v":0},{"$f":"(SUMIF(Table3[Material, select from list],\"=\"&A4,Table3[Replacement Cost]))*LiningRate*LiningPctUC*yield_pipe","v":0},{"$f":"(SUMIF(Table3[Material, select from list],\"=\"&A4,Table3[Replacement Cost]))*ReplacementRate*ReplacementPctUC*yield_pipe","v":0},{"$f":"J4+K4+L4","v":0}]
["Lined Non-Plastic",{"$f":"(SUMIF(Table3[Material, select from list],\"=\"&A5,Table3[LengthMiles]))/SUM(Table3[LengthMiles])","v":{"$error":"#DIV/0!"}},{"$f":"(SUMIF(Table3[Material, select from list],\"=\"&A5,Table3[LengthMiles]))","v":0},{"$f":"(SUMIFS(Table3[LengthMiles],Table3[Material, select from list],\"=\"&A5,Table3[YRS Beyond EUL],\"<0\" ))","v":0},{"$f":"(SUMIFS(Table3[LengthMiles],Table3[Material, select from list],\"=\"&A5,Table3[YRS Beyond EUL],\">=0\" ))","v":0},{"$f":"E5*yield_pipe*RepairRate","v":0},{"$f":"E5*LiningRate*yield_pipe","v":0},{"$f":"E5*yield_pipe*ReplacementRate","v":0},{"$f":"F5+G5+H5","v":0},{"$f":"(SUMIF(Table3[Material, select from list],\"=\"&A5,Table3[Replacement Cost]))*RepairRate*RepairPctUC*yield_pipe","v":0},{"$f":"(SUMIF(Table3[Material, select from list],\"=\"&A5,Table3[Replacement Cost]))*LiningRate*LiningPctUC*yield_pipe","v":0},{"$f":"(SUMIF(Table3[Material, select from list],\"=\"&A5,Table3[Replacement Cost]))*ReplacementRate*ReplacementPctUC*yield_pipe","v":0},{"$f":"J5+K5+L5","v":0}]
["Plastic",{"$f":"(SUMIF(Table3[Material, select from list],\"=\"&A6,Table3[LengthMiles]))/SUM(Table3[LengthMiles])","v":{"$error":"#DIV/0!"}},{"$f":"(SUMIF(Table3[Material, select from list],\"=\"&A6,Table3[LengthMiles]))","v":0},{"$f":"(SUMIFS(Table3[LengthMiles],Table3[Material, select from list],\"=\"&A6,Table3[YRS Beyond EUL],\"<0\" ))","v":0},{"$f":"(SUMIFS(Table3[LengthMiles],Table3[Material, select from list],\"=\"&A6,Table3[YRS Beyond EUL],\">=0\" ))","v":0},{"$f":"E6*yield_pipe*RepairRate","v":0},{"$f":"E6*LiningRate*yield_pipe","v":0},{"$f":"E6*yield_pipe*ReplacementRate","v":0},0,{"$f":"(SUMIF(Table3[Material, select from list],\"=\"&A6,Table3[Replacement Cost]))*RepairRate*RepairPctUC*yield_pipe","v":0},{"$f":"(SUMIF(Table3[Material, select from list],\"=\"&A6,Table3[Replacement Cost]))*LiningRate*LiningPctUC*yield_pipe","v":0},{"$f":"(SUMIF(Table3[Material, select from list],\"=\"&A6,Table3[Replacement Cost]))*ReplacementRate*ReplacementPctUC*yield_pipe","v":0},{"$f":"J6+K6+L6","v":0}]
["Unknown",{"$f":"(SUMIF(Table3[Material, select from list],\"=\"&A7,Table3[LengthMiles]))/SUM(Table3[LengthMiles])","v":{"$error":"#DIV/0!"}},{"$f":"(SUMIF(Table3[Material, select from list],\"=\"&A7,Table3[LengthMiles]))","v":0},{"$f":"(SUMIFS(Table3[LengthMiles],Table3[Material, select from list],\"=\"&A7,Table3[YRS Beyond EUL],\"<0\" ))","v":0},{"$f":"(SUMIFS(Table3[LengthMiles],Table3[Material, select from list],\"=\"&A7,Table3[YRS Beyond EUL],\">=0\" ))","v":0},{"$f":"E7*yield_pipe*RepairRate","v":0},{"$f":"E7*LiningRate*yield_pipe","v":0},{"$f":"E7*yield_pipe*ReplacementRate","v":0},{"$f":"F7+G7+H7","v":0},{"$f":"(SUMIF(Table3[Material, select from list],\"=\"&A7,Table3[Replacement Cost]))*RepairRate*RepairPctUC*yield_pipe","v":0},{"$f":"(SUMIF(Table3[Material, select from list],\"=\"&A7,Table3[Replacement Cost]))*LiningRate*LiningPctUC*yield_pipe","v":0},{"$f":"(SUMIF(Table3[Material, select from list],\"=\"&A7,Table3[Replacement Cost]))*ReplacementRate*ReplacementPctUC*yield_pipe","v":0},{"$f":"J7+K7+L7","v":0}]
["Total",{"$f":"SUM(B4:B7)","v":{"$error":"#DIV/0!"}},0,0,{"$f":"SUM(E4:E7)","v":0},0,0,0,{"$f":"SUM(I4:I7)","v":0},0,0,0,0]
[null,null,null,null,null,null,null,null,null,null,null,null," "]
[]
[]
["Manhole Data"]
["Manhole Type","System Count","Count Beyond Remaining Useful Life","Count Estimated for Lining","Count Estimated for Repair","Count Estimated for Replacement","Count Estimated for Rehabilitation","Total Estimated Lining Cost","Estimated Repair Cost","Estimated Replacement Cost","Total Estimated Rehabilitation Costs"]
["Brick",{"$f":"(COUNTIF(TableMH[Material, select from list],\"=\"&A14))","v":0},{"$f":"(COUNTIFS(TableMH[Material, select from list],\"=\"&Table5[[#This Row],[Manhole Type]],TableMH[YRS Beyond EUL],\">=0\" ))","v":0},{"$f":"(B14*'Model Selection and Inputs'!$E$10)*'Model Selection and Inputs'!$E$11","v":0},{"$f":"(B14*'Model Selection and Inputs'!$E$10)*'Model Selection and Inputs'!$E$13","v":0},{"$f":"(B14*'Model Selection and Inputs'!$E$10)*'Model Selection and Inputs'!$E$12","v":0},{"$f":"SUM(Table5[[#This Row],[Count Estimated for Lining]:[Count Estimated for Replacement]])","v":0},{"$f":"(SUMIF(TableMH[Material, select from list],\"=\"&A14,TableMH[Lining Cost]))*('Model Selection and Inputs'!$E$10)*'Model Selection and Inputs'!$E$11","v":0},{"$f":"(SUMIF(TableMH[Material, select from list],\"=\"&A14,TableMH[Repair Cost]))*('Model Selection and Inputs'!$E$10)*'Model Selection and Inputs'!$E$13","v":0},{"$f":"(SUMIF(TableMH[Material, select from list],\"=\"&A14,TableMH[Replacement Cost]))*('Model Selection and Inputs'!$E$10)*'Model Selection and Inputs'!$E$12","v":0},{"$f":"SUM(Table5[[#This Row],[Total Estimated Lining Cost]:[Estimated Replacement Cost]])","v":0}]
["Precast Concrete",{"$f":"(COUNTIF(TableMH[Material, select from list],\"=\"&A15))","v":0},{"$f":"(COUNTIFS(TableMH[Material, select from list],\"=\"&Table5[[#This Row],[Manhole Type]],TableMH[YRS Beyond EUL],\">=0\" ))","v":0},{"$f":"(B15*'Model Selection and Inputs'!$E$10)*'Model Selection and Inputs'!$E$11","v":0},{"$f":"(B15*'Model Selection and Inputs'!$E$10)*'Model Selection and Inputs'!$E$13","v":0},{"$f":"(B15*'Model Selection and Inputs'!$E$10)*'Model Selection and Inputs'!$E$12","v":0},{"$f":"SUM(Table5[[#This Row],[Count Estimated for Lining]:[Count Estimated for Replacement]])","v":0},{"$f":"(SUMIF(TableMH[Material, select from list],\"=\"&A15,TableMH[Lining Cost]))*('Model Selection and Inputs'!$E$10)*'Model Selection and Inputs'!$E$11","v":0},{"$f":"(SUMIF(TableMH[Material, select from list],\"=\"&A15,TableMH[Repair Cost]))*('Model Selection and Inputs'!$E$10)*'Model Selection and Inputs'!$E$13","v":0},{"$f":"(SUMIF(TableMH[Material, select from list],\"=\"&A15,TableMH[Replacement Cost]))*('Model Selection and Inputs'!$E$10)*'Model Selection and Inputs'!$E$12","v":0},{"$f":"SUM(Table5[[#This Row],[Total Estimated Lining Cost]:[Estimated Replacement Cost]])","v":0}]
["Plastic/Fiberglass",{"$f":"(COUNTIF(TableMH[Material, select from list],\"=\"&A16))","v":0},{"$f":"(COUNTIFS(TableMH[Material, select from list],\"=\"&Table5[[#This Row],[Manhole Type]],TableMH[YRS Beyond EUL],\">=0\" ))","v":0},{"$f":"(B16*'Model Selection and Inputs'!$E$10)*'Model Selection and Inputs'!$E$11","v":0},{"$f":"(B16*'Model Selection and Inputs'!$E$10)*'Model Selection and Inputs'!$E$13","v":0},{"$f":"(B16*'Model Selection and Inputs'!$E$10)*'Model Selection and Inputs'!$E$12","v":0},{"$f":"SUM(Table5[[#This Row],[Count Estimated for Lining]:[Count Estimated for Replacement]])","v":0},{"$f":"(SUMIF(TableMH[Material, select from list],\"=\"&A16,TableMH[Lining Cost]))*('Model Selection and Inputs'!$E$10)*'Model Selection and Inputs'!$E$11","v":0},{"$f":"(SUMIF(TableMH[Material, select from list],\"=\"&A16,TableMH[Repair Cost]))*('Model Selection and Inputs'!$E$10)*'Model Selection and Inputs'!$E$13","v":0},{"$f":"(SUMIF(TableMH[Material, select from list],\"=\"&A16,TableMH[Replacement Cost]))*('Model Selection and Inputs'!$E$10)*'Model Selection and Inputs'!$E$12","v":0},{"$f":"SUM(Table5[[#This Row],[Total Estimated Lining Cost]:[Estimated Replacement Cost]])","v":0}]
["Other",{"$f":"(COUNTIF(TableMH[Material, select from list],\"=\"&A17))","v":0},{"$f":"(COUNTIFS(TableMH[Material, select from list],\"=\"&Table5[[#This Row],[Manhole Type]],TableMH[YRS Beyond EUL],\">=0\" ))","v":0},{"$f":"(B17*'Model Selection and Inputs'!$E$10)*'Model Selection and Inputs'!$E$11","v":0},{"$f":"(B17*'Model Selection and Inputs'!$E$10)*'Model Selection and Inputs'!$E$13","v":0},{"$f":"(B17*'Model Selection and Inputs'!$E$10)*'Model Selection and Inputs'!$E$12","v":0},{"$f":"SUM(Table5[[#This Row],[Count Estimated for Lining]:[Count Estimated for Replacement]])","v":0},{"$f":"(SUMIF(TableMH[Material, select from list],\"=\"&A17,TableMH[Lining Cost]))*('Model Selection and Inputs'!$E$10)*'Model Selection and Inputs'!$E$11","v":0},{"$f":"(SUMIF(TableMH[Material, select from list],\"=\"&A17,TableMH[Repair Cost]))*('Model Selection and Inputs'!$E$10)*'Model Selection and Inputs'!$E$13","v":0},{"$f":"(SUMIF(TableMH[Material, select from list],\"=\"&A17,TableMH[Replacement Cost]))*('Model Selection and Inputs'!$E$10)*'Model Selection and Inputs'!$E$12","v":0},{"$f":"SUM(Table5[[#This Row],[Total Estimated Lining Cost]:[Estimated Replacement Cost]])","v":0}]
["Total",{"$f":"SUM(B14:B17)","v":0},{"$f":"SUM(C14:C17)","v":0},0,0,0,0,0,0,0,{"$f":"SUM(K14:K17)","v":0}]
[]
[]
[]
[]
["Total Collection System Data",null,15728403.708900001,11728403.708900001,0.74568302835865163]
[{"$f":"\"Planning Period Estimates (Costs Escalated \" & TEXT(Annual_Inflation, \"##0.00%\") & \" per year)\"","v":"Planning Period Estimates (Costs Escalated 2.50% per year)"}]
["Total Planning Horizon (yrs):",{"$f":"'Model Selection and Inputs'!E4","v":20},"End Year","Miles Estimated for Repair","Miles Estimated for Lining ","Miles Estimated for Replacement","Miles Estimated For Rehabilitation","Total Estimated Repair Costs","Total Estimated Lining Costs","Total Estimated Replacement Costs","Total Estimated Rehabilitation Costs","Total Estimated Manhole Costs","Cumulative Repair Cost","Cumulative  Lining Cost","Cumulative  Replacement Cost","Cumulative  Total Rehabiliation Cost","Accumulated Manhole Cost"]
["Current Year:",{"$f":"First_Year_of_Planning_Period","v":2022}]
["End Planning Year:",{"$f":"B26+Total_Planning_Period","v":2042}]
["Number of Periods:",{"$f":"'Model Selection and Inputs'!E5","v":5}]
["Planning Years","Begin Year",{"$f":"C25","v":"End Year"},{"$f":"D25","v":"Miles Estimated for Repair"},"Miles Estimated for Lining ","Miles Estimated for Replacement",{"$f":"G25","v":"Miles Estimated For Rehabilitation"},"Total Estimated Repair Costs","Total Estimated Lining Costs","Total Estimated Replacement Costs","Total Estimated Rehabilitation Costs","Total Estimated Manhole Costs","Cumulative Repair Cost","Cumulative  Lining Cost","Cumulative  Replacement Cost","Cumulative  Total Rehabiliation Cost"]
[]
[{"$f":"IF(ISNUMBER(C31),(CONCATENATE(B31,\"-\",C31)),\"\")","v":"2022-2026"},{"$f":"B26","v":2022},{"$f":"IFERROR(IF(B31+Total_Planning_Period/Number_of_Periods<=End_Planning_Year,B31+Total_Planning_Period/Number_of_Periods,\"\"),\"\")","v":2026},{"$f":"IF(C31<=End_Planning_Year,SUM(Table4[Miles Estimated for Repair])/Number_of_Periods,\"\")","v":0},{"$f":"IF(C31<=End_Planning_Year,SUM(Table4[[Miles Estimated for Lining ]])/Number_of_Periods,\"\")","v":0},{"$f":"IF(C31<=End_Planning_Year,SUM(Table4[Miles Estimated for Replacement])/Number_of_Periods,\"\")","v":0},{"$f":"IF(C31<=End_Planning_Year,SUM(Table4[Miles Estimated For Rehabilitation])/Number_of_Periods,\"\")","v":0},{"$f":"IF(C31<=End_Planning_Year,MAX(Table4[Estimated Repair Costs])/Number_of_Periods*S31,\"\")","v":0},{"$f":"IF(C31<=End_Planning_Year,MAX(Table4[Total Estimated Lining Costs])/Number_of_Periods*S31,\"\")","v":0},{"$f":"IF(C31<=End_Planning_Year,MAX(Table4[Total Estimated Replacement Costs])/Number_of_Periods*S31,\"\")","v":0},{"$f":"IF(D31<=End_Planning_Year,MAX(Table4[Total Estimated Rehabilitation Costs])/Number_of_Periods*S31,\"\")","v":0},{"$f":"IF(E31<=End_Planning_Year,SUM(Table5[Total Estimated Rehabilitation Costs])/Number_of_Periods*S31,\"\")","v":0},{"$f":"IFERROR(H31,\"\")","v":0},{"$f":"IFERROR(I31,\"\")","v":0},{"$f":"IFERROR(J31,\"\")","v":0},{"$f":"IFERROR(K31+L31,\"\")","v":0},{"$f":"L31","v":0},null,{"$f":"IFERROR(AVERAGEIFS(tblEscalation[FACTOR],tblEscalation[YEAR],\">=\" & B31, tblEscalation[YEAR], \"<=\" & C31-1), 0)","v":1.0510254119866067}]
[{"$f":"IF(ISNUMBER(C32),(CONCATENATE(B32,\"-\",C32)),\"\")","v":"2026-2030"},{"$f":"IF(C31<$B$27,C31,\"\")","v":2026},{"$f":"IFERROR(IF(B32+Total_Planning_Period/Number_of_Periods<=End_Planning_Year,B32+Total_Planning_Period/Number_of_Periods,\"\"),\"\")","v":2030},{"$f":"IF(C32<=End_Planning_Year,SUM(Table4[Miles Estimated For Rehabilitation])/Number_of_Periods,\"\")","v":0},{"$f":"IF(C32<=End_Planning_Year,SUM(Table4[[Miles Estimated for Lining ]])/Number_of_Periods,\"\")","v":0},{"$f":"IF(C32<=End_Planning_Year,SUM(Table4[Miles Estimated for Replacement])/Number_of_Periods,\"\")","v":0},{"$f":"IF(C32<=End_Planning_Year,SUM(Table4[Miles Estimated For Rehabilitation])/Number_of_Periods,\"\")","v":0},{"$f":"IF(C32<=End_Planning_Year,MAX(Table4[Estimated Repair Costs])/Number_of_Periods*S32,\"\")","v":0},{"$f":"IF(C32<=End_Planning_Year,MAX(Table4[Total Estimated Lining Costs])/Number_of_Periods*S32,\"\")","v":0},{"$f":"IF(C32<=End_Planning_Year,MAX(Table4[Total Estimated Replacement Costs])/Number_of_Periods*S32,\"\")","v":0},{"$f":"IF(D32<=End_Planning_Year,MAX(Table4[Total Estimated Rehabilitation Costs])/Number_of_Periods*S32,\"\")","v":0},{"$f":"IF(E32<=End_Planning_Year,SUM(Table5[Total Estimated Rehabilitation Costs])/Number_of_Periods*S32,\"\")","v":0},{"$f":"IFERROR(M31+(H32),\"\")","v":0},{"$f":"IFERROR(N31+(I32),\"\")","v":0},{"$f":"IFERROR(O31+(J32),\"\")","v":0},{"$f":"IFERROR(P31+(K32+L32),\"\")","v":0},{"$f":"IFERROR(Q31+(L32),\"\")","v":0},null,{"$f":"IFERROR(AVERAGEIFS(tblEscalation[FACTOR],tblEscalation[YEAR],\">=\" & B32, tblEscalation[YEAR], \"<=\" & C32-1), 0)","v":1.1601353981252673}]
["2030-2034",{"$f":"IF(C32<$B$27,C32,\"\")","v":2030},2034,{"$f":"IF(C33<=End_Planning_Year,SUM(Table4[Miles Estimated For Rehabilitation])/Number_of_Periods,\"\")","v":0},{"$f":"IF(C33<=End_Planning_Year,SUM(Table4[[Miles Estimated for Lining ]])/Number_of_Periods,\"\")","v":0},{"$f":"IF(C33<=End_Planning_Year,SUM(Table4[Miles Estimated for Replacement])/Number_of_Periods,\"\")","v":0},{"$f":"IF(C33<=End_Planning_Year,SUM(Table4[Miles Estimated For Rehabilitation])/Number_of_Periods,\"\")","v":0},{"$f":"IF(C33<=End_Planning_Year,MAX(Table4[Estimated Repair Costs])/Number_of_Periods*S33,\"\")","v":0},{"$f":"IF(C33<=End_Planning_Year,MAX(Table4[Total Estimated Lining Costs])/Number_of_Periods*S33,\"\")","v":0},{"$f":"IF(C33<=End_Planning_Year,MAX(Table4[Total Estimated Replacement Costs])/Number_of_Periods*S33,\"\")","v":0},{"$f":"IF(D33<=End_Planning_Year,MAX(Table4[Total Estimated Rehabilitation Costs])/Number_of_Periods*S33,\"\")","v":0},{"$f":"IF(E33<=End_Planning_Year,SUM(Table5[Total Estimated Rehabilitation Costs])/Number_of_Periods*S33,\"\")","v":0},{"$f":"IFERROR(M32+(H33),\"\")","v":0},0,{"$f":"IFERROR(O32+(J33),\"\")","v":0},{"$f":"IFERROR(P32+(K33+L33),\"\")","v":0},{"$f":"IFERROR(Q32+(L33),\"\")","v":0},null,{"$f":"IFERROR(AVERAGEIFS(tblEscalation[FACTOR],tblEscalation[YEAR],\">=\" & B33, tblEscalation[YEAR], \"<=\" & C33-1), 0)","v":1.2805724073210363}]
["2034-2038",2034,2038,{"$f":"IF(C34<=End_Planning_Year,SUM(Table4[Miles Estimated For Rehabilitation])/Number_of_Periods,\"\")","v":0},{"$f":"IF(C34<=End_Planning_Year,SUM(Table4[[Miles Estimated for Lining ]])/Number_of_Periods,\"\")","v":0},{"$f":"IF(C34<=End_Planning_Year,SUM(Table4[Miles Estimated for Replacement])/Number_of_Periods,\"\")","v":0},{"$f":"IF(C34<=End_Planning_Year,SUM(Table4[Miles Estimated For Rehabilitation])/Number_of_Periods,\"\")","v":0},{"$f":"IF(C34<=End_Planning_Year,MAX(Table4[Estimated Repair Costs])/Number_of_Periods*S34,\"\")","v":0},{"$f":"IF(C34<=End_Planning_Year,MAX(Table4[Total Estimated Lining Costs])/Number_of_Periods*S34,\"\")","v":0},{"$f":"IF(C34<=End_Planning_Year,MAX(Table4[Total Estimated Replacement Costs])/Number_of_Periods*S34,\"\")","v":0},{"$f":"IF(D34<=End_Planning_Year,MAX(Table4[Total Estimated Rehabilitation Costs])/Number_of_Periods*S34,\"\")","v":0},{"$f":"IF(E34<=End_Planning_Year,SUM(Table5[Total Estimated Rehabilitation Costs])/Number_of_Periods*S34,\"\")","v":0},0,0,0,0,0,null,{"$f":"IFERROR(AVERAGEIFS(tblEscalation[FACTOR],tblEscalation[YEAR],\">=\" & B34, tblEscalation[YEAR], \"<=\" & C34-1), 0)","v":1.4135123305796475}]
["2038-2042",2038,2042,{"$f":"IF(C35<=End_Planning_Year,SUM(Table4[Miles Estimated For Rehabilitation])/Number_of_Periods,\"\")","v":0},{"$f":"IF(C35<=End_Planning_Year,SUM(Table4[[Miles Estimated for Lining ]])/Number_of_Periods,\"\")","v":0},{"$f":"IF(C35<=End_Planning_Year,SUM(Table4[Miles Estimated for Replacement])/Number_of_Periods,\"\")","v":0},{"$f":"IF(C35<=End_Planning_Year,SUM(Table4[Miles Estimated For Rehabilitation])/Number_of_Periods,\"\")","v":0},{"$f":"IF(C35<=End_Planning_Year,MAX(Table4[Estimated Repair Costs])/Number_of_Periods*S35,\"\")","v":0},{"$f":"IF(C35<=End_Planning_Year,MAX(Table4[Total Estimated Lining Costs])/Number_of_Periods*S35,\"\")","v":0},{"$f":"IF(C35<=End_Planning_Year,MAX(Table4[Total Estimated Replacement Costs])/Number_of_Periods*S35,\"\")","v":0},{"$f":"IF(D35<=End_Planning_Year,MAX(Table4[Total Estimated Rehabilitation Costs])/Number_of_Periods*S35,\"\")","v":0},{"$f":"IF(E35<=End_Planning_Year,SUM(Table5[Total Estimated Rehabilitation Costs])/Number_of_Periods*S35,\"\")","v":0},0,0,0,0,0,null,{"$f":"IFERROR(AVERAGEIFS(tblEscalation[FACTOR],tblEscalation[YEAR],\">=\" & B35, tblEscalation[YEAR], \"<=\" & C35-1), 0)","v":1.5602531315512005}]
["","","",{"$f":"IF(C36<=End_Planning_Year,SUM(Table4[Miles Estimated For Rehabilitation])/Number_of_Periods,\"\")","v":""},{"$f":"IF(C36<=End_Planning_Year,SUM(Table4[[Miles Estimated for Lining ]])/Number_of_Periods,\"\")","v":""},{"$f":"IF(C36<=End_Planning_Year,SUM(Table4[Miles Estimated for Replacement])/Number_of_Periods,\"\")","v":""},{"$f":"IF(C36<=End_Planning_Year,SUM(Table4[Miles Estimated For Rehabilitation])/Number_of_Periods,\"\")","v":""},{"$f":"IF(C36<=End_Planning_Year,MAX(Table4[Estimated Repair Costs])/Number_of_Periods*S36,\"\")","v":""},{"$f":"IF(C36<=End_Planning_Year,MAX(Table4[Total Estimated Lining Costs])/Number_of_Periods*S36,\"\")","v":""},{"$f":"IF(C36<=End_Planning_Year,MAX(Table4[Total Estimated Replacement Costs])/Number_of_Periods*S36,\"\")","v":""},{"$f":"IF(D36<=End_Planning_Year,MAX(Table4[Total Estimated Rehabilitation Costs])/Number_of_Periods*S36,\"\")","v":""},{"$f":"IF(E36<=End_Planning_Year,SUM(Table5[Total Estimated Rehabilitation Costs])/Number_of_Periods*S36,\"\")","v":""},"","","","","",null,{"$f":"IFERROR(AVERAGEIFS(tblEscalation[FACTOR],tblEscalation[YEAR],\">=\" & B36, tblEscalation[YEAR], \"<=\" & C36-1), 0)","v":0}]
["","","",{"$f":"IF(C37<=End_Planning_Year,SUM(Table4[Miles Estimated For Rehabilitation])/Number_of_Periods,\"\")","v":""},{"$f":"IF(C37<=End_Planning_Year,SUM(Table4[[Miles Estimated for Lining ]])/Number_of_Periods,\"\")","v":""},{"$f":"IF(C37<=End_Planning_Year,SUM(Table4[Miles Estimated for Replacement])/Number_of_Periods,\"\")","v":""},{"$f":"IF(C37<=End_Planning_Year,SUM(Table4[Miles Estimated For Rehabilitation])/Number_of_Periods,\"\")","v":""},{"$f":"IF(C37<=End_Planning_Year,MAX(Table4[Estimated Repair Costs])/Number_of_Periods*S37,\"\")","v":""},{"$f":"IF(C37<=End_Planning_Year,MAX(Table4[Total Estimated Lining Costs])/Number_of_Periods*S37,\"\")","v":""},{"$f":"IF(C37<=End_Planning_Year,MAX(Table4[Total Estimated Replacement Costs])/Number_of_Periods*S37,\"\")","v":""},{"$f":"IF(D37<=End_Planning_Year,MAX(Table4[Total Estimated Rehabilitation Costs])/Number_of_Periods*S37,\"\")","v":""},{"$f":"IF(E37<=End_Planning_Year,SUM(Table5[Total Estimated Rehabilitation Costs])/Number_of_Periods*S37,\"\")","v":""},"","","","","",null,{"$f":"IFERROR(AVERAGEIFS(tblEscalation[FACTOR],tblEscalation[YEAR],\">=\" & B37, tblEscalation[YEAR], \"<=\" & C37-1), 0)","v":0}]
["","","",{"$f":"IF(C38<=End_Planning_Year,SUM(Table4[Miles Estimated For Rehabilitation])/Number_of_Periods,\"\")","v":""},{"$f":"IF(C38<=End_Planning_Year,SUM(Table4[[Miles Estimated for Lining ]])/Number_of_Periods,\"\")","v":""},{"$f":"IF(C38<=End_Planning_Year,SUM(Table4[Miles Estimated for Replacement])/Number_of_Periods,\"\")","v":""},{"$f":"IF(C38<=End_Planning_Year,SUM(Table4[Miles Estimated For Rehabilitation])/Number_of_Periods,\"\")","v":""},{"$f":"IF(C38<=End_Planning_Year,MAX(Table4[Estimated Repair Costs])/Number_of_Periods*S38,\"\")","v":""},{"$f":"IF(C38<=End_Planning_Year,MAX(Table4[Total Estimated Lining Costs])/Number_of_Periods*S38,\"\")","v":""},{"$f":"IF(C38<=End_Planning_Year,MAX(Table4[Total Estimated Replacement Costs])/Number_of_Periods*S38,\"\")","v":""},{"$f":"IF(D38<=End_Planning_Year,MAX(Table4[Total Estimated Rehabilitation Costs])/Number_of_Periods*S38,\"\")","v":""},{"$f":"IF(E38<=End_Planning_Year,SUM(Table5[Total Estimated Rehabilitation Costs])/Number_of_Periods*S38,\"\")","v":""},"","","","","",null,{"$f":"IFERROR(AVERAGEIFS(tblEscalation[FACTOR],tblEscalation[YEAR],\">=\" & B38, tblEscalation[YEAR], \"<=\" & C38-1), 0)","v":0}]
["","","",{"$f":"IF(C39<=End_Planning_Year,SUM(Table4[Miles Estimated For Rehabilitation])/Number_of_Periods,\"\")","v":""},{"$f":"IF(C39<=End_Planning_Year,SUM(Table4[[Miles Estimated for Lining ]])/Number_of_Periods,\"\")","v":""},{"$f":"IF(C39<=End_Planning_Year,SUM(Table4[Miles Estimated for Replacement])/Number_of_Periods,\"\")","v":""},{"$f":"IF(C39<=End_Planning_Year,SUM(Table4[Miles Estimated For Rehabilitation])/Number_of_Periods,\"\")","v":""},{"$f":"IF(C39<=End_Planning_Year,MAX(Table4[Estimated Repair Costs])/Number_of_Periods*S39,\"\")","v":""},{"$f":"IF(C39<=End_Planning_Year,MAX(Table4[Total Estimated Lining Costs])/Number_of_Periods*S39,\"\")","v":""},{"$f":"IF(C39<=End_Planning_Year,MAX(Table4[Total Estimated Replacement Costs])/Number_of_Periods*S39,\"\")","v":""},{"$f":"IF(D39<=End_Planning_Year,MAX(Table4[Total Estimated Rehabilitation Costs])/Number_of_Periods*S39,\"\")","v":""},{"$f":"IF(E39<=End_Planning_Year,SUM(Table5[Total Estimated Rehabilitation Costs])/Number_of_Periods*S39,\"\")","v":""},"","","","","",null,{"$f":"IFERROR(AVERAGEIFS(tblEscalation[FACTOR],tblEscalation[YEAR],\">=\" & B39, tblEscalation[YEAR], \"<=\" & C39-1), 0)","v":0}]
["","","",{"$f":"IF(C40<=End_Planning_Year,SUM(Table4[Miles Estimated For Rehabilitation])/Number_of_Periods,\"\")","v":""},{"$f":"IF(C40<=End_Planning_Year,SUM(Table4[[Miles Estimated for Lining ]])/Number_of_Periods,\"\")","v":""},{"$f":"IF(C40<=End_Planning_Year,SUM(Table4[Miles Estimated for Replacement])/Number_of_Periods,\"\")","v":""},{"$f":"IF(C40<=End_Planning_Year,SUM(Table4[Miles Estimated For Rehabilitation])/Number_of_Periods,\"\")","v":""},{"$f":"IF(C40<=End_Planning_Year,MAX(Table4[Estimated Repair Costs])/Number_of_Periods*S40,\"\")","v":""},{"$f":"IF(C40<=End_Planning_Year,MAX(Table4[Total Estimated Lining Costs])/Number_of_Periods*S40,\"\")","v":""},{"$f":"IF(C40<=End_Planning_Year,MAX(Table4[Total Estimated Replacement Costs])/Number_of_Periods*S40,\"\")","v":""},{"$f":"IF(D40<=End_Planning_Year,MAX(Table4[Total Estimated Rehabilitation Costs])/Number_of_Periods*S40,\"\")","v":""},{"$f":"IF(E40<=End_Planning_Year,SUM(Table5[Total Estimated Rehabilitation Costs])/Number_of_Periods*S40,\"\")","v":""},"","","","","",null,{"$f":"IFERROR(AVERAGEIFS(tblEscalation[FACTOR],tblEscalation[YEAR],\">=\" & B40, tblEscalation[YEAR], \"<=\" & C40-1), 0)","v":0}]
["","","",{"$f":"IF(C41<=End_Planning_Year,SUM(Table4[Miles Estimated For Rehabilitation])/Number_of_Periods,\"\")","v":""},{"$f":"IF(C41<=End_Planning_Year,SUM(Table4[[Miles Estimated for Lining ]])/Number_of_Periods,\"\")","v":""},{"$f":"IF(C41<=End_Planning_Year,SUM(Table4[Miles Estimated for Replacement])/Number_of_Periods,\"\")","v":""},{"$f":"IF(C41<=End_Planning_Year,SUM(Table4[Miles Estimated For Rehabilitation])/Number_of_Periods,\"\")","v":""},{"$f":"IF(C41<=End_Planning_Year,MAX(Table4[Estimated Repair Costs])/Number_of_Periods*S41,\"\")","v":""},{"$f":"IF(C41<=End_Planning_Year,MAX(Table4[Total Estimated Lining Costs])/Number_of_Periods*S41,\"\")","v":""},{"$f":"IF(C41<=End_Planning_Year,MAX(Table4[Total Estimated Replacement Costs])/Number_of_Periods*S41,\"\")","v":""},{"$f":"IF(D41<=End_Planning_Year,MAX(Table4[Total Estimated Rehabilitation Costs])/Number_of_Periods*S41,\"\")","v":""},{"$f":"IF(E41<=End_Planning_Year,SUM(Table5[Total Estimated Rehabilitation Costs])/Number_of_Periods*S41,\"\")","v":""},"","","","","",null,{"$f":"IFERROR(AVERAGEIFS(tblEscalation[FACTOR],tblEscalation[YEAR],\">=\" & B41, tblEscalation[YEAR], \"<=\" & C41-1), 0)","v":0}]
["","","",{"$f":"IF(C42<=End_Planning_Year,SUM(Table4[Miles Estimated For Rehabilitation])/Number_of_Periods,\"\")","v":""},{"$f":"IF(C42<=End_Planning_Year,SUM(Table4[[Miles Estimated for Lining ]])/Number_of_Periods,\"\")","v":""},{"$f":"IF(C42<=End_Planning_Year,SUM(Table4[Miles Estimated for Replacement])/Number_of_Periods,\"\")","v":""},{"$f":"IF(C42<=End_Planning_Year,SUM(Table4[Miles Estimated For Rehabilitation])/Number_of_Periods,\"\")","v":""},{"$f":"IF(C42<=End_Planning_Year,MAX(Table4[Estimated Repair Costs])/Number_of_Periods*S42,\"\")","v":""},{"$f":"IF(C42<=End_Planning_Year,MAX(Table4[Total Estimated Lining Costs])/Number_of_Periods*S42,\"\")","v":""},{"$f":"IF(C42<=End_Planning_Year,MAX(Table4[Total Estimated Replacement Costs])/Number_of_Periods*S42,\"\")","v":""},{"$f":"IF(D42<=End_Planning_Year,MAX(Table4[Total Estimated Rehabilitation Costs])/Number_of_Periods*S42,\"\")","v":""},{"$f":"IF(E42<=End_Planning_Year,SUM(Table5[Total Estimated Rehabilitation Costs])/Number_of_Periods*S42,\"\")","v":""},"","","","","",null,{"$f":"IFERROR(AVERAGEIFS(tblEscalation[FACTOR],tblEscalation[YEAR],\">=\" & B42, tblEscalation[YEAR], \"<=\" & C42-1), 0)","v":0}]
["","","",{"$f":"IF(C43<=End_Planning_Year,SUM(Table4[Miles Estimated For Rehabilitation])/Number_of_Periods,\"\")","v":""},{"$f":"IF(C43<=End_Planning_Year,SUM(Table4[[Miles Estimated for Lining ]])/Number_of_Periods,\"\")","v":""},{"$f":"IF(C43<=End_Planning_Year,SUM(Table4[Miles Estimated for Replacement])/Number_of_Periods,\"\")","v":""},{"$f":"IF(C43<=End_Planning_Year,SUM(Table4[Miles Estimated For Rehabilitation])/Number_of_Periods,\"\")","v":""},{"$f":"IF(C43<=End_Planning_Year,MAX(Table4[Estimated Repair Costs])/Number_of_Periods*S43,\"\")","v":""},{"$f":"IF(C43<=End_Planning_Year,MAX(Table4[Total Estimated Lining Costs])/Number_of_Periods*S43,\"\")","v":""},{"$f":"IF(C43<=End_Planning_Year,MAX(Table4[Total Estimated Replacement Costs])/Number_of_Periods*S43,\"\")","v":""},{"$f":"IF(D43<=End_Planning_Year,MAX(Table4[Total Estimated Rehabilitation Costs])/Number_of_Periods*S43,\"\")","v":""},{"$f":"IF(E43<=End_Planning_Year,SUM(Table5[Total Estimated Rehabilitation Costs])/Number_of_Periods*S43,\"\")","v":""},"","","","","",null,{"$f":"IFERROR(AVERAGEIFS(tblEscalation[FACTOR],tblEscalation[YEAR],\">=\" & B43, tblEscalation[YEAR], \"<=\" & C43-1), 0)","v":0}]
["","","",{"$f":"IF(C44<=End_Planning_Year,SUM(Table4[Miles Estimated For Rehabilitation])/Number_of_Periods,\"\")","v":""},{"$f":"IF(C44<=End_Planning_Year,SUM(Table4[[Miles Estimated for Lining ]])/Number_of_Periods,\"\")","v":""},{"$f":"IF(C44<=End_Planning_Year,SUM(Table4[Miles Estimated for Replacement])/Number_of_Periods,\"\")","v":""},{"$f":"IF(C44<=End_Planning_Year,SUM(Table4[Miles Estimated For Rehabilitation])/Number_of_Periods,\"\")","v":""},{"$f":"IF(C44<=End_Planning_Year,MAX(Table4[Estimated Repair Costs])/Number_of_Periods*S44,\"\")","v":""},{"$f":"IF(C44<=End_Planning_Year,MAX(Table4[Total Estimated Lining Costs])/Number_of_Periods*S44,\"\")","v":""},{"$f":"IF(C44<=End_Planning_Year,MAX(Table4[Total Estimated Replacement Costs])/Number_of_Periods*S44,\"\")","v":""},{"$f":"IF(D44<=End_Planning_Year,MAX(Table4[Total Estimated Rehabilitation Costs])/Number_of_Periods*S44,\"\")","v":""},{"$f":"IF(E44<=End_Planning_Year,SUM(Table5[Total Estimated Rehabilitation Costs])/Number_of_Periods*S44,\"\")","v":""},"","","","","",null,{"$f":"IFERROR(AVERAGEIFS(tblEscalation[FACTOR],tblEscalation[YEAR],\">=\" & B44, tblEscalation[YEAR], \"<=\" & C44-1), 0)","v":0}]
["","","",{"$f":"IF(C45<=End_Planning_Year,SUM(Table4[Miles Estimated For Rehabilitation])/Number_of_Periods,\"\")","v":""},{"$f":"IF(C45<=End_Planning_Year,SUM(Table4[[Miles Estimated for Lining ]])/Number_of_Periods,\"\")","v":""},{"$f":"IF(C45<=End_Planning_Year,SUM(Table4[Miles Estimated for Replacement])/Number_of_Periods,\"\")","v":""},{"$f":"IF(C45<=End_Planning_Year,SUM(Table4[Miles Estimated For Rehabilitation])/Number_of_Periods,\"\")","v":""},{"$f":"IF(C45<=End_Planning_Year,MAX(Table4[Estimated Repair Costs])/Number_of_Periods*S45,\"\")","v":""},{"$f":"IF(C45<=End_Planning_Year,MAX(Table4[Total Estimated Lining Costs])/Number_of_Periods*S45,\"\")","v":""},{"$f":"IF(C45<=End_Planning_Year,MAX(Table4[Total Estimated Replacement Costs])/Number_of_Periods*S45,\"\")","v":""},{"$f":"IF(D45<=End_Planning_Year,MAX(Table4[Total Estimated Rehabilitation Costs])/Number_of_Periods*S45,\"\")","v":""},{"$f":"IF(E45<=End_Planning_Year,SUM(Table5[Total Estimated Rehabilitation Costs])/Number_of_Periods*S45,\"\")","v":""},"","","","","",null,{"$f":"IFERROR(AVERAGEIFS(tblEscalation[FACTOR],tblEscalation[YEAR],\">=\" & B45, tblEscalation[YEAR], \"<=\" & C45-1), 0)","v":0}]
["","","",{"$f":"IF(C46<=End_Planning_Year,SUM(Table4[Miles Estimated For Rehabilitation])/Number_of_Periods,\"\")","v":""},{"$f":"IF(C46<=End_Planning_Year,SUM(Table4[[Miles Estimated for Lining ]])/Number_of_Periods,\"\")","v":""},{"$f":"IF(C46<=End_Planning_Year,SUM(Table4[Miles Estimated for Replacement])/Number_of_Periods,\"\")","v":""},{"$f":"IF(C46<=End_Planning_Year,SUM(Table4[Miles Estimated For Rehabilitation])/Number_of_Periods,\"\")","v":""},{"$f":"IF(C46<=End_Planning_Year,MAX(Table4[Estimated Repair Costs])/Number_of_Periods*S46,\"\")","v":""},{"$f":"IF(C46<=End_Planning_Year,MAX(Table4[Total Estimated Lining Costs])/Number_of_Periods*S46,\"\")","v":""},{"$f":"IF(C46<=End_Planning_Year,MAX(Table4[Total Estimated Replacement Costs])/Number_of_Periods*S46,\"\")","v":""},{"$f":"IF(D46<=End_Planning_Year,MAX(Table4[Total Estimated Rehabilitation Costs])/Number_of_Periods*S46,\"\")","v":""},{"$f":"IF(E46<=End_Planning_Year,SUM(Table5[Total Estimated Rehabilitation Costs])/Number_of_Periods*S46,\"\")","v":""},"","","","","",null,{"$f":"IFERROR(AVERAGEIFS(tblEscalation[FACTOR],tblEscalation[YEAR],\">=\" & B46, tblEscalation[YEAR], \"<=\" & C46-1), 0)","v":0}]
["","","",{"$f":"IF(C47<=End_Planning_Year,SUM(Table4[Miles Estimated For Rehabilitation])/Number_of_Periods,\"\")","v":""},{"$f":"IF(C47<=End_Planning_Year,SUM(Table4[[Miles Estimated for Lining ]])/Number_of_Periods,\"\")","v":""},{"$f":"IF(C47<=End_Planning_Year,SUM(Table4[Miles Estimated for Replacement])/Number_of_Periods,\"\")","v":""},{"$f":"IF(C47<=End_Planning_Year,SUM(Table4[Miles Estimated For Rehabilitation])/Number_of_Periods,\"\")","v":""},{"$f":"IF(C47<=End_Planning_Year,MAX(Table4[Estimated Repair Costs])/Number_of_Periods*S47,\"\")","v":""},{"$f":"IF(C47<=End_Planning_Year,MAX(Table4[Total Estimated Lining Costs])/Number_of_Periods*S47,\"\")","v":""},{"$f":"IF(C47<=End_Planning_Year,MAX(Table4[Total Estimated Replacement Costs])/Number_of_Periods*S47,\"\")","v":""},{"$f":"IF(D47<=End_Planning_Year,MAX(Table4[Total Estimated Rehabilitation Costs])/Number_of_Periods*S47,\"\")","v":""},{"$f":"IF(E47<=End_Planning_Year,SUM(Table5[Total Estimated Rehabilitation Costs])/Number_of_Periods*S47,\"\")","v":""},"","","","","",null,{"$f":"IFERROR(AVERAGEIFS(tblEscalation[FACTOR],tblEscalation[YEAR],\">=\" & B47, tblEscalation[YEAR], \"<=\" & C47-1), 0)","v":0}]
["","","",{"$f":"IF(C48<=End_Planning_Year,SUM(Table4[Miles Estimated For Rehabilitation])/Number_of_Periods,\"\")","v":""},{"$f":"IF(C48<=End_Planning_Year,SUM(Table4[[Miles Estimated for Lining ]])/Number_of_Periods,\"\")","v":""},{"$f":"IF(C48<=End_Planning_Year,SUM(Table4[Miles Estimated for Replacement])/Number_of_Periods,\"\")","v":""},{"$f":"IF(C48<=End_Planning_Year,SUM(Table4[Miles Estimated For Rehabilitation])/Number_of_Periods,\"\")","v":""},{"$f":"IF(C48<=End_Planning_Year,MAX(Table4[Estimated Repair Costs])/Number_of_Periods*S48,\"\")","v":""},{"$f":"IF(C48<=End_Planning_Year,MAX(Table4[Total Estimated Lining Costs])/Number_of_Periods*S48,\"\")","v":""},{"$f":"IF(C48<=End_Planning_Year,MAX(Table4[Total Estimated Replacement Costs])/Number_of_Periods*S48,\"\")","v":""},{"$f":"IF(D48<=End_Planning_Year,MAX(Table4[Total Estimated Rehabilitation Costs])/Number_of_Periods*S48,\"\")","v":""},{"$f":"IF(E48<=End_Planning_Year,SUM(Table5[Total Estimated Rehabilitation Costs])/Number_of_Periods*S48,\"\")","v":""},"","","","","",null,{"$f":"IFERROR(AVERAGEIFS(tblEscalation[FACTOR],tblEscalation[YEAR],\">=\" & B48, tblEscalation[YEAR], \"<=\" & C48-1), 0)","v":0}]
["","","",{"$f":"IF(C49<=End_Planning_Year,SUM(Table4[Miles Estimated For Rehabilitation])/Number_of_Periods,\"\")","v":""},{"$f":"IF(C49<=End_Planning_Year,SUM(Table4[[Miles Estimated for Lining ]])/Number_of_Periods,\"\")","v":""},{"$f":"IF(C49<=End_Planning_Year,SUM(Table4[Miles Estimated for Replacement])/Number_of_Periods,\"\")","v":""},{"$f":"IF(C49<=End_Planning_Year,SUM(Table4[Miles Estimated For Rehabilitation])/Number_of_Periods,\"\")","v":""},{"$f":"IF(C49<=End_Planning_Year,MAX(Table4[Estimated Repair Costs])/Number_of_Periods*S49,\"\")","v":""},{"$f":"IF(C49<=End_Planning_Year,MAX(Table4[Total Estimated Lining Costs])/Number_of_Periods*S49,\"\")","v":""},{"$f":"IF(C49<=End_Planning_Year,MAX(Table4[Total Estimated Replacement Costs])/Number_of_Periods*S49,\"\")","v":""},{"$f":"IF(D49<=End_Planning_Year,MAX(Table4[Total Estimated Rehabilitation Costs])/Number_of_Periods*S49,\"\")","v":""},{"$f":"IF(E49<=End_Planning_Year,SUM(Table5[Total Estimated Rehabilitation Costs])/Number_of_Periods*S49,\"\")","v":""},"","","","","",null,{"$f":"IFERROR(AVERAGEIFS(tblEscalation[FACTOR],tblEscalation[YEAR],\">=\" & B49, tblEscalation[YEAR], \"<=\" & C49-1), 0)","v":0}]

{"sheet":"Risk-based Cost Forecast","index":14,"n_rows":4,"n_cols":38,"rows_kept":4,"cut":false,"hidden":false,"merged":[]}
[]
[]
[null,null,null,null,null,null,null,null,null,null,null,null,null,null,null,null,null,null,null,null,null,null,null,null,null,null,"Row Labels","Cumulative Repair Costs","Cumulative Lining Costs","Cumulative Replacement Costs",null,null,null,null,"Row Labels","Total Estimated Repair_Costs","Total Estimated Lining_Costs","Total Estimated Replacement_Costs"]
[null,null,null,null,null,null,null,null,null,null,null,null,null,null,null,null,null,null,null,null,null,null,null,null,null,null,"Grand Total",null,null,null,null,null,null,null,"Grand Total"]

{"sheet":"Age-based Cost Forecast","index":15,"n_rows":2,"n_cols":26,"rows_kept":2,"cut":false,"hidden":true,"merged":[]}
[null,null,null,null,null,null,null,null,null,null,null,null,null,null,null,null,"Row Labels","Estimated Repair Costs","Estimated Lining Costs","Estimated Replacement Costs",null,null,"Row Labels","Cumulative Repair Costs","Cumulative  Lining Costs","Cumulative  Replacement Costs"]
[null,null,null,null,null,null,null,null,null,null,null,null,null,null,null,null,"Grand Total",null,null,null,null,null,"Grand Total"]

{"sheet":"CalsRiskPipes","index":16,"n_rows":1735,"n_cols":21,"rows_kept":1735,"cut":false,"hidden":true,"merged":[]}
[null,null,null,null,null,null,null,null,null,"Leftover $",null,{"$f":"SUM(L3:L263)","v":0},{"$f":"SUM(P3:P7000)+SUM(Q3:Q70000)+SUM(R3:R70000)","v":{"$error":"#VALUE!"}},null,null,{"$f":"B3-SUM(P3:P700000)","v":0},{"$f":"(B4+P1)-SUM(Q3:Q700000)","v":{"$error":"#VALUE!"}},{"$f":"(B5+Q1 )-SUM(R3:R700000)","v":{"$error":"#VALUE!"}},null,null,{"$f":"SUMIF(U3:U1735,\"YES\",U3:U1735)","v":0}]
["MAX EUL Age",{"$f":"MAX(Table3[YRS Beyond EUL])","v":0},null,null,null,"Total Risk","Sum of Replacement Cost","Sum of LengthMiles",null,null,null,null,"Replace Lines","Lining Lines","Repair Lines","Replace Lines","Lining Lines","Repair Lines","BY Miles","Within EUL Planning Period For Renewal By Cost","In Planning By Miles"]
["Total Replacement",{"$f":"MAX(Table47[Total Estimated Replacement Costs])","v":0},null,null,null,"(blank)",null,null,null,null,null,null,{"$f":"I3","v":0},{"$f":"IF(P3=0,I3+N2,0)","v":{"$error":"#VALUE!"}},{"$f":"IF(AND(Q3=0,P3=0),K3+O2,0)","v":{"$error":"#VALUE!"}},{"$f":"IF(M3<=$B$3,I3,0)","v":0},{"$f":"IF(AND(P3=0,N3<($B$4+$P$1)),J3,0)","v":{"$error":"#VALUE!"}},{"$f":"IF(AND(P3=0,Q3=0,O3<($B$5+$Q$1)),K3,0)","v":{"$error":"#VALUE!"}},{"$f":"L3","v":0},{"$f":"IF(OR(P3>1,Q3>1,R3>1),\"YES\",\"NO\")","v":{"$error":"#VALUE!"}},{"$f":"IF(S3<='Collection System Summary_Table'!$I$8,\"Yes\",\"NO\")","v":"Yes"}]
["Total Lining ",{"$f":"MAX(Table47[Estimated Repair Costs])","v":0},null,null,null,"Grand Total",null,null,null,null,null,null,{"$f":"M3+I4","v":0},{"$error":"#VALUE!"},{"$f":"IF(AND(Q4=0,P4=0),K4+O3,0)","v":{"$error":"#VALUE!"}},{"$f":"IF(M4<=$B$3,I4,0)","v":0},{"$f":"IF(AND(P4=0,N4<($B$4+$P$1)),J4,0)","v":{"$error":"#VALUE!"}},{"$f":"IF(AND(P4=0,Q4=0,O4<($B$5+$Q$1)),K4,0)","v":{"$error":"#VALUE!"}},{"$f":"S3+L4","v":0},{"$f":"IF(OR(P4>1,Q4>1,R4>1),\"YES\",\"NO\")","v":{"$error":"#VALUE!"}},{"$f":"IF(S4<='Collection System Summary_Table'!$I$8,\"Yes\",\"NO\")","v":"Yes"}]
["Total Repair",{"$f":"MAX(Table47[Total Estimated Lining Costs])","v":0},null,null,null,null,null,null,null,null,null,null,{"$f":"M4+I5","v":0},{"$error":"#VALUE!"},{"$error":"#VALUE!"},{"$f":"IF(M5<=$B$3,I5,0)","v":0},{"$error":"#VALUE!"},{"$error":"#VALUE!"},0,{"$error":"#VALUE!"},{"$f":"IF(S5<='Collection System Summary_Table'!$I$8,\"Yes\",\"NO\")","v":"Yes"}]
["Total Rehab Amount",{"$f":"MAX(Table47[Total Estimated Rehabilitation Costs])","v":0},null,null,null,null,null,null,null,null,null,null,0,{"$error":"#VALUE!"},{"$error":"#VALUE!"},0,{"$error":"#VALUE!"},{"$error":"#VALUE!"},0,{"$error":"#VALUE!"},{"$f":"IF(S6<='Collection System Summary_Table'!$I$8,\"Yes\",\"NO\")","v":"Yes"}]
["Total Replacement",{"$f":"MAX(Table47[Miles Estimated for Replacement])","v":0},null,null,null,null,null,null,null,null,null,null,0,{"$error":"#VALUE!"},{"$error":"#VALUE!"},0,{"$error":"#VALUE!"},{"$error":"#VALUE!"},0,{"$error":"#VALUE!"},{"$f":"IF(S7<='Collection System Summary_Table'!$I$8,\"Yes\",\"NO\")","v":"Yes"}]
["Total Lining ",{"$f":"MAX(Table47[[Miles Estimated for Lining ]])","v":0},null,null,null,null,null,null,null,null,null,null,0,{"$error":"#VALUE!"},{"$error":"#VALUE!"},0,{"$error":"#VALUE!"},{"$error":"#VALUE!"},0,{"$error":"#VALUE!"},{"$f":"IF(S8<='Collection System Summary_Table'!$I$8,\"Yes\",\"NO\")","v":"Yes"}]
["Total Repair",{"$f":"MAX(Table47[Miles Estimated For Repair])","v":0},null,null,null,null,null,null,null,null,null,null,0,{"$error":"#VALUE!"},{"$error":"#VALUE!"},0,{"$error":"#VALUE!"},{"$error":"#VALUE!"},0,{"$error":"#VALUE!"},{"$f":"IF(S9<='Collection System Summary_Table'!$I$8,\"Yes\",\"NO\")","v":"Yes"}]
["Total Rehab Amount",{"$f":"MAX(Table47[Miles Estimated For Rehabilitation])","v":0},null,null,null,null,null,null,null,null,null,null,0,{"$error":"#VALUE!"},{"$error":"#VALUE!"},0,{"$error":"#VALUE!"},{"$error":"#VALUE!"},0,{"$error":"#VALUE!"},{"$f":"IF(S10<='Collection System Summary_Table'!$I$8,\"Yes\",\"NO\")","v":"Yes"}]
[null,null,null,null,null,null,null,null,null,null,null,null,0,{"$error":"#VALUE!"},{"$error":"#VALUE!"},0,{"$error":"#VALUE!"},{"$error":"#VALUE!"},0,{"$error":"#VALUE!"},{"$f":"IF(S11<='Collection System Summary_Table'!$I$8,\"Yes\",\"NO\")","v":"Yes"}]
[null,null,null,null,null,null,null,null,null,null,null,null,0,{"$error":"#VALUE!"},{"$error":"#VALUE!"},0,{"$error":"#VALUE!"},{"$error":"#VALUE!"},0,{"$error":"#VALUE!"},{"$f":"IF(S12<='Collection System Summary_Table'!$I$8,\"Yes\",\"NO\")","v":"Yes"}]
[null,null,null,null,null,null,null,null,null,null,null,null,0,{"$error":"#VALUE!"},{"$error":"#VALUE!"},0,{"$error":"#VALUE!"},{"$error":"#VALUE!"},0,{"$error":"#VALUE!"},{"$f":"IF(S13<='Collection System Summary_Table'!$I$8,\"Yes\",\"NO\")","v":"Yes"}]
[null,null,null,null,null,null,null,null,null,null,null,null,0,{"$error":"#VALUE!"},{"$error":"#VALUE!"},0,{"$error":"#VALUE!"},{"$error":"#VALUE!"},0,{"$error":"#VALUE!"},{"$f":"IF(S14<='Collection System Summary_Table'!$I$8,\"Yes\",\"NO\")","v":"Yes"}]
[null,null,null,null,null,null,null,null,null,null,null,null,0,{"$error":"#VALUE!"},{"$error":"#VALUE!"},0,{"$error":"#VALUE!"},{"$error":"#VALUE!"},0,{"$error":"#VALUE!"},{"$f":"IF(S15<='Collection System Summary_Table'!$I$8,\"Yes\",\"NO\")","v":"Yes"}]
[null,null,null,null,null,null,null,null,null,null,null,null,0,{"$error":"#VALUE!"},{"$error":"#VALUE!"},0,{"$error":"#VALUE!"},{"$error":"#VALUE!"},0,{"$error":"#VALUE!"},{"$f":"IF(S16<='Collection System Summary_Table'!$I$8,\"Yes\",\"NO\")","v":"Yes"}]
[null,null,null,null,null,null,null,null,null,null,null,null,0,{"$error":"#VALUE!"},{"$error":"#VALUE!"},0,{"$error":"#VALUE!"},{"$error":"#VALUE!"},0,{"$error":"#VALUE!"},{"$f":"IF(S17<='Collection System Summary_Table'!$I$8,\"Yes\",\"NO\")","v":"Yes"}]
[null,null,null,null,null,null,null,null,null,null,null,null,0,{"$error":"#VALUE!"},{"$error":"#VALUE!"},0,{"$error":"#VALUE!"},{"$error":"#VALUE!"},0,{"$error":"#VALUE!"},{"$f":"IF(S18<='Collection System Summary_Table'!$I$8,\"Yes\",\"NO\")","v":"Yes"}]
[null,null,null,null,null,null,null,null,null,null,null,null,0,{"$error":"#VALUE!"},{"$error":"#VALUE!"},0,{"$error":"#VALUE!"},{"$error":"#VALUE!"},0,{"$error":"#VALUE!"},{"$f":"IF(S19<='Collection System Summary_Table'!$I$8,\"Yes\",\"NO\")","v":"Yes"}]
[null,null,null,null,null,null,null,null,null,null,null,null,0,{"$error":"#VALUE!"},{"$error":"#VALUE!"},0,{"$error":"#VALUE!"},{"$error":"#VALUE!"},0,{"$error":"#VALUE!"},{"$f":"IF(S20<='Collection System Summary_Table'!$I$8,\"Yes\",\"NO\")","v":"Yes"}]
[null,null,null,null,null,null,null,null,null,null,null,null,0,{"$error":"#VALUE!"},{"$error":"#VALUE!"},0,{"$error":"#VALUE!"},{"$error":"#VALUE!"},0,{"$error":"#VALUE!"},{"$f":"IF(S21<='Collection System Summary_Table'!$I$8,\"Yes\",\"NO\")","v":"Yes"}]
[null,null,null,null,null,null,null,null,null,null,null,null,0,{"$error":"#VALUE!"},{"$error":"#VALUE!"},0,{"$error":"#VALUE!"},{"$error":"#VALUE!"},0,{"$error":"#VALUE!"},{"$f":"IF(S22<='Collection System Summary_Table'!$I$8,\"Yes\",\"NO\")","v":"Yes"}]
[null,null,null,null,null,null,null,null,null,null,null,null,0,{"$error":"#VALUE!"},{"$error":"#VALUE!"},0,{"$error":"#VALUE!"},{"$error":"#VALUE!"},0,{"$error":"#VALUE!"},{"$f":"IF(S23<='Collection System Summary_Table'!$I$8,\"Yes\",\"NO\")","v":"Yes"}]
[null,null,null,null,null,null,null,null,null,null,null,null,0,{"$error":"#VALUE!"},{"$error":"#VALUE!"},0,{"$error":"#VALUE!"},{"$error":"#VALUE!"},0,{"$error":"#VALUE!"},{"$f":"IF(S24<='Collection System Summary_Table'!$I$8,\"Yes\",\"NO\")","v":"Yes"}]
[null,null,null,null,null,null,null,null,null,null,null,null,0,{"$error":"#VALUE!"},{"$error":"#VALUE!"},0,{"$error":"#VALUE!"},{"$error":"#VALUE!"},0,{"$error":"#VALUE!"},{"$f":"IF(S25<='Collection System Summary_Table'!$I$8,\"Yes\",\"NO\")","v":"Yes"}]
[null,null,null,null,null,null,null,null,null,null,null,null,0,{"$error":"#VALUE!"},{"$error":"#VALUE!"},0,{"$error":"#VALUE!"},{"$error":"#VALUE!"},0,{"$error":"#VALUE!"},{"$f":"IF(S26<='Collection System Summary_Table'!$I$8,\"Yes\",\"NO\")","v":"Yes"}]
[null,null,null,null,null,null,null,null,null,null,null,null,0,{"$error":"#VALUE!"},{"$error":"#VALUE!"},0,{"$error":"#VALUE!"},{"$error":"#VALUE!"},0,{"$error":"#VALUE!"},{"$f":"IF(S27<='Collection System Summary_Table'!$I$8,\"Yes\",\"NO\")","v":"Yes"}]
[null,null,null,null,null,null,null,null,null,null,null,null,0,{"$error":"#VALUE!"},{"$error":"#VALUE!"},0,{"$error":"#VALUE!"},{"$error":"#VALUE!"},0,{"$error":"#VALUE!"},{"$f":"IF(S28<='Collection System Summary_Table'!$I$8,\"Yes\",\"NO\")","v":"Yes"}]
[null,null,null,null,null,null,null,null,null,null,null,null,0,{"$error":"#VALUE!"},{"$error":"#VALUE!"},0,{"$error":"#VALUE!"},{"$error":"#VALUE!"},0,{"$error":"#VALUE!"},{"$f":"IF(S29<='Collection System Summary_Table'!$I$8,\"Yes\",\"NO\")","v":"Yes"}]
[null,null,null,null,null,null,null,null,null,null,null,null,0,{"$error":"#VALUE!"},{"$error":"#VALUE!"},0,{"$error":"#VALUE!"},{"$error":"#VALUE!"},0,{"$error":"#VALUE!"},{"$f":"IF(S30<='Collection System Summary_Table'!$I$8,\"Yes\",\"NO\")","v":"Yes"}]
[null,null,null,null,null,null,null,null,null,null,null,null,0,{"$error":"#VALUE!"},{"$error":"#VALUE!"},0,{"$error":"#VALUE!"},{"$error":"#VALUE!"},0,{"$error":"#VALUE!"},{"$f":"IF(S31<='Collection System Summary_Table'!$I$8,\"Yes\",\"NO\")","v":"Yes"}]
[null,null,null,null,null,null,null,null,null,null,null,null,0,{"$error":"#VALUE!"},{"$error":"#VALUE!"},0,{"$error":"#VALUE!"},{"$error":"#VALUE!"},0,{"$error":"#VALUE!"},{"$f":"IF(S32<='Collection System Summary_Table'!$I$8,\"Yes\",\"NO\")","v":"Yes"}]
[null,null,null,null,null,null,null,null,null,null,null,null,0,{"$error":"#VALUE!"},{"$error":"#VALUE!"},0,{"$error":"#VALUE!"},{"$error":"#VALUE!"},0,{"$error":"#VALUE!"},{"$f":"IF(S33<='Collection System Summary_Table'!$I$8,\"Yes\",\"NO\")","v":"Yes"}]
[null,null,null,null,null,null,null,null,null,null,null,null,0,{"$error":"#VALUE!"},{"$f":"IF(AND(Q34=0,P34=0),K34+O33,0)","v":{"$error":"#VALUE!"}},0,{"$error":"#VALUE!"},{"$error":"#VALUE!"},0,{"$error":"#VALUE!"},{"$f":"IF(S34<='Collection System Summary_Table'!$I$8,\"Yes\",\"NO\")","v":"Yes"}]
[null,null,null,null,null,null,null,null,null,null,null,null,0,{"$error":"#VALUE!"},{"$f":"IF(AND(Q35=0,P35=0),K35+O34,0)","v":{"$error":"#VALUE!"}},0,{"$error":"#VALUE!"},{"$error":"#VALUE!"},0,{"$error":"#VALUE!"},{"$f":"IF(S35<='Collection System Summary_Table'!$I$8,\"Yes\",\"NO\")","v":"Yes"}]
[null,null,null,null,null,null,null,null,null,null,null,null,0,{"$error":"#VALUE!"},{"$f":"IF(AND(Q36=0,P36=0),K36+O35,0)","v":{"$error":"#VALUE!"}},0,{"$error":"#VALUE!"},{"$error":"#VALUE!"},0,{"$error":"#VALUE!"},{"$f":"IF(S36<='Collection System Summary_Table'!$I$8,\"Yes\",\"NO\")","v":"Yes"}]
[null,null,null,null,null,null,null,null,null,null,null,null,0,{"$error":"#VALUE!"},{"$error":"#VALUE!"},0,{"$error":"#VALUE!"},{"$error":"#VALUE!"},0,{"$error":"#VALUE!"},{"$f":"IF(S37<='Collection System Summary_Table'!$I$8,\"Yes\",\"NO\")","v":"Yes"}]
[null,null,null,null,null,null,null,null,null,null,null,null,0,{"$error":"#VALUE!"},{"$error":"#VALUE!"},0,{"$error":"#VALUE!"},{"$error":"#VALUE!"},0,{"$error":"#VALUE!"},{"$f":"IF(S38<='Collection System Summary_Table'!$I$8,\"Yes\",\"NO\")","v":"Yes"}]
[null,null,null,null,null,null,null,null,null,null,null,null,0,{"$error":"#VALUE!"},{"$error":"#VALUE!"},0,{"$error":"#VALUE!"},{"$error":"#VALUE!"},0,{"$error":"#VALUE!"},{"$f":"IF(S39<='Collection System Summary_Table'!$I$8,\"Yes\",\"NO\")","v":"Yes"}]
[null,null,null,null,null,null,null,null,null,null,null,null,0,{"$error":"#VALUE!"},{"$error":"#VALUE!"},0,{"$error":"#VALUE!"},{"$error":"#VALUE!"},0,{"$error":"#VALUE!"},{"$f":"IF(S40<='Collection System Summary_Table'!$I$8,\"Yes\",\"NO\")","v":"Yes"}]
[null,null,null,null,null,null,null,null,null,null,null,null,0,{"$error":"#VALUE!"},{"$error":"#VALUE!"},0,{"$error":"#VALUE!"},{"$error":"#VALUE!"},0,{"$error":"#VALUE!"},{"$f":"IF(S41<='Collection System Summary_Table'!$I$8,\"Yes\",\"NO\")","v":"Yes"}]
[null,null,null,null,null,null,null,null,null,null,null,null,0,{"$error":"#VALUE!"},{"$error":"#VALUE!"},0,{"$error":"#VALUE!"},{"$error":"#VALUE!"},0,{"$error":"#VALUE!"},{"$f":"IF(S42<='Collection System Summary_Table'!$I$8,\"Yes\",\"NO\")","v":"Yes"}]
[null,null,null,null,null,null,null,null,null,null,null,null,0,{"$error":"#VALUE!"},{"$error":"#VALUE!"},0,{"$error":"#VALUE!"},{"$error":"#VALUE!"},0,{"$error":"#VALUE!"},{"$f":"IF(S43<='Collection System Summary_Table'!$I$8,\"Yes\",\"NO\")","v":"Yes"}]
[null,null,null,null,null,null,null,null,null,null,null,null,0,{"$error":"#VALUE!"},{"$error":"#VALUE!"},0,{"$error":"#VALUE!"},{"$error":"#VALUE!"},0,{"$error":"#VALUE!"},{"$f":"IF(S44<='Collection System Summary_Table'!$I$8,\"Yes\",\"NO\")","v":"Yes"}]
[null,null,null,null,null,null,null,null,null,null,null,null,0,{"$error":"#VALUE!"},{"$error":"#VALUE!"},0,{"$error":"#VALUE!"},{"$error":"#VALUE!"},0,{"$error":"#VALUE!"},{"$f":"IF(S45<='Collection System Summary_Table'!$I$8,\"Yes\",\"NO\")","v":"Yes"}]
[null,null,null,null,null,null,null,null,null,null,null,null,0,{"$error":"#VALUE!"},{"$error":"#VALUE!"},0,{"$error":"#VALUE!"},{"$error":"#VALUE!"},0,{"$error":"#VALUE!"},{"$f":"IF(S46<='Collection System Summary_Table'!$I$8,\"Yes\",\"NO\")","v":"Yes"}]
[null,null,null,null,null,null,null,null,null,null,null,null,0,{"$error":"#VALUE!"},{"$error":"#VALUE!"},0,{"$error":"#VALUE!"},{"$error":"#VALUE!"},0,{"$error":"#VALUE!"},{"$f":"IF(S47<='Collection System Summary_Table'!$I$8,\"Yes\",\"NO\")","v":"Yes"}]
[null,null,null,null,null,null,null,null,null,null,null,null,0,{"$error":"#VALUE!"},{"$error":"#VALUE!"},0,{"$error":"#VALUE!"},{"$error":"#VALUE!"},0,{"$error":"#VALUE!"},{"$f":"IF(S48<='Collection System Summary_Table'!$I$8,\"Yes\",\"NO\")","v":"Yes"}]
[null,null,null,null,null,null,null,null,null,null,null,null,0,{"$error":"#VALUE!"},{"$error":"#VALUE!"},0,{"$error":"#VALUE!"},{"$error":"#VALUE!"},0,{"$error":"#VALUE!"},{"$f":"IF(S49<='Collection System Summary_Table'!$I$8,\"Yes\",\"NO\")","v":"Yes"}]
[null,null,null,null,null,null,null,null,null,null,null,null,0,{"$error":"#VALUE!"},{"$error":"#VALUE!"},0,{"$error":"#VALUE!"},{"$error":"#VALUE!"},0,{"$error":"#VALUE!"},{"$f":"IF(S50<='Collection System Summary_Table'!$I$8,\"Yes\",\"NO\")","v":"Yes"}]
[null,null,null,null,null,null,null,null,null,null,null,null,0,{"$error":"#VALUE!"},{"$error":"#VALUE!"},0,{"$error":"#VALUE!"},{"$error":"#VALUE!"},0,{"$error":"#VALUE!"},{"$f":"IF(S51<='Collection System Summary_Table'!$I$8,\"Yes\",\"NO\")","v":"Yes"}]
[null,null,null,null,null,null,null,null,null,null,null,null,0,{"$error":"#VALUE!"},{"$error":"#VALUE!"},0,{"$error":"#VALUE!"},{"$error":"#VALUE!"},0,{"$error":"#VALUE!"},{"$f":"IF(S52<='Collection System Summary_Table'!$I$8,\"Yes\",\"NO\")","v":"Yes"}]
[null,null,null,null,null,null,null,null,null,null,null,null,0,{"$error":"#VALUE!"},{"$error":"#VALUE!"},0,{"$error":"#VALUE!"},{"$error":"#VALUE!"},0,{"$error":"#VALUE!"},{"$f":"IF(S53<='Collection System Summary_Table'!$I$8,\"Yes\",\"NO\")","v":"Yes"}]
[null,null,null,null,null,null,null,null,null,null,null,null,0,{"$error":"#VALUE!"},{"$error":"#VALUE!"},0,{"$error":"#VALUE!"},{"$error":"#VALUE!"},0,{"$error":"#VALUE!"},{"$f":"IF(S54<='Collection System Summary_Table'!$I$8,\"Yes\",\"NO\")","v":"Yes"}]
[null,null,null,null,null,null,null,null,null,null,null,null,0,{"$error":"#VALUE!"},{"$error":"#VALUE!"},0,{"$error":"#VALUE!"},{"$error":"#VALUE!"},0,{"$error":"#VALUE!"},{"$f":"IF(S55<='Collection System Summary_Table'!$I$8,\"Yes\",\"NO\")","v":"Yes"}]
[null,null,null,null,null,null,null,null,null,null,null,null,0,{"$error":"#VALUE!"},{"$error":"#VALUE!"},0,{"$error":"#VALUE!"},{"$error":"#VALUE!"},0,{"$error":"#VALUE!"},{"$f":"IF(S56<='Collection System Summary_Table'!$I$8,\"Yes\",\"NO\")","v":"Yes"}]
[null,null,null,null,null,null,null,null,null,null,null,null,0,{"$error":"#VALUE!"},{"$error":"#VALUE!"},0,{"$error":"#VALUE!"},{"$error":"#VALUE!"},0,{"$error":"#VALUE!"},{"$f":"IF(S57<='Collection System Summary_Table'!$I$8,\"Yes\",\"NO\")","v":"Yes"}]
[null,null,null,null,null,null,null,null,null,null,null,null,0,{"$error":"#VALUE!"},{"$error":"#VALUE!"},0,{"$error":"#VALUE!"},{"$error":"#VALUE!"},0,{"$error":"#VALUE!"},{"$f":"IF(S58<='Collection System Summary_Table'!$I$8,\"Yes\",\"NO\")","v":"Yes"}]
[null,null,null,null,null,null,null,null,null,null,null,null,0,{"$error":"#VALUE!"},{"$error":"#VALUE!"},0,{"$error":"#VALUE!"},{"$error":"#VALUE!"},0,{"$error":"#VALUE!"},{"$f":"IF(S59<='Collection System Summary_Table'!$I$8,\"Yes\",\"NO\")","v":"Yes"}]
[null,null,null,null,null,null,null,null,null,null,null,null,0,{"$error":"#VALUE!"},{"$error":"#VALUE!"},0,{"$error":"#VALUE!"},{"$error":"#VALUE!"},0,{"$error":"#VALUE!"},{"$f":"IF(S60<='Collection System Summary_Table'!$I$8,\"Yes\",\"NO\")","v":"Yes"}]
[null,null,null,null,null,null,null,null,null,null,null,null,0,{"$error":"#VALUE!"},{"$error":"#VALUE!"},0,{"$error":"#VALUE!"},{"$error":"#VALUE!"},0,{"$error":"#VALUE!"},{"$f":"IF(S61<='Collection System Summary_Table'!$I$8,\"Yes\",\"NO\")","v":"Yes"}]
[null,null,null,null,null,null,null,null,null,null,null,null,0,{"$error":"#VALUE!"},{"$error":"#VALUE!"},0,{"$error":"#VALUE!"},{"$error":"#VALUE!"},0,{"$error":"#VALUE!"},{"$f":"IF(S62<='Collection System Summary_Table'!$I$8,\"Yes\",\"NO\")","v":"Yes"}]
[null,null,null,null,null,null,null,null,null,null,null,null,0,{"$error":"#VALUE!"},{"$error":"#VALUE!"},0,{"$error":"#VALUE!"},{"$error":"#VALUE!"},0,{"$error":"#VALUE!"},{"$f":"IF(S63<='Collection System Summary_Table'!$I$8,\"Yes\",\"NO\")","v":"Yes"}]
[null,null,null,null,null,null,null,null,null,null,null,null,0,{"$error":"#VALUE!"},{"$error":"#VALUE!"},0,{"$error":"#VALUE!"},{"$error":"#VALUE!"},0,{"$error":"#VALUE!"},{"$f":"IF(S64<='Collection System Summary_Table'!$I$8,\"Yes\",\"NO\")","v":"Yes"}]
[null,null,null,null,null,null,null,null,null,null,null,null,0,{"$error":"#VALUE!"},{"$error":"#VALUE!"},0,{"$error":"#VALUE!"},{"$error":"#VALUE!"},0,{"$error":"#VALUE!"},{"$f":"IF(S65<='Collection System Summary_Table'!$I$8,\"Yes\",\"NO\")","v":"Yes"}]
[null,null,null,null,null,null,null,null,null,null,null,null,0,{"$error":"#VALUE!"},{"$error":"#VALUE!"},0,{"$error":"#VALUE!"},{"$error":"#VALUE!"},0,{"$error":"#VALUE!"},{"$f":"IF(S66<='Collection System Summary_Table'!$I$8,\"Yes\",\"NO\")","v":"Yes"}]
[null,null,null,null,null,null,null,null,null,null,null,null,0,{"$f":"IF(P67=0,I67+N66,0)","v":{"$error":"#VALUE!"}},{"$error":"#VALUE!"},0,{"$error":"#VALUE!"},{"$error":"#VALUE!"},0,{"$error":"#VALUE!"},{"$f":"IF(S67<='Collection System Summary_Table'!$I$8,\"Yes\",\"NO\")","v":"Yes"}]
[null,null,null,null,null,null,null,null,null,null,null,null,0,{"$error":"#VALUE!"},{"$f":"IF(AND(Q68=0,P68=0),K68+O67,0)","v":{"$error":"#VALUE!"}},0,{"$f":"IF(AND(P68=0,N68<($B$4+$P$1)),J68,0)","v":{"$error":"#VALUE!"}},{"$f":"IF(AND(P68=0,Q68=0,O68<($B$5+$Q$1)),K68,0)","v":{"$error":"#VALUE!"}},{"$f":"S67+L68","v":0},{"$f":"IF(OR(P68>1,Q68>1,R68>1),\"YES\",\"NO\")","v":{"$error":"#VALUE!"}},{"$f":"IF(S68<='Collection System Summary_Table'!$I$8,\"Yes\",\"NO\")","v":"Yes"}]
[null,null,null,null,null,null,null,null,null,null,null,null,{"$f":"M68+I69","v":0},{"$error":"#VALUE!"},{"$error":"#VALUE!"},{"$f":"IF(M69<=$B$3,I69,0)","v":0},{"$error":"#VALUE!"},{"$error":"#VALUE!"},0,{"$error":"#VALUE!"},{"$f":"IF(S69<='Collection System Summary_Table'!$I$8,\"Yes\",\"NO\")","v":"Yes"}]
[null,null,null,null,null,null,null,null,null,null,null,null,0,{"$error":"#VALUE!"},{"$error":"#VALUE!"},0,{"$error":"#VALUE!"},{"$error":"#VALUE!"},0,{"$error":"#VALUE!"},{"$f":"IF(S70<='Collection System Summary_Table'!$I$8,\"Yes\",\"NO\")","v":"Yes"}]
[null,null,null,null,null,null,null,null,null,null,null,null,0,{"$error":"#VALUE!"},{"$error":"#VALUE!"},0,{"$error":"#VALUE!"},{"$error":"#VALUE!"},0,{"$error":"#VALUE!"},{"$f":"IF(S71<='Collection System Summary_Table'!$I$8,\"Yes\",\"NO\")","v":"Yes"}]
[null,null,null,null,null,null,null,null,null,null,null,null,0,{"$error":"#VALUE!"},{"$error":"#VALUE!"},0,{"$error":"#VALUE!"},{"$error":"#VALUE!"},0,{"$error":"#VALUE!"},{"$f":"IF(S72<='Collection System Summary_Table'!$I$8,\"Yes\",\"NO\")","v":"Yes"}]
[null,null,null,null,null,null,null,null,null,null,null,null,0,{"$error":"#VALUE!"},{"$error":"#VALUE!"},0,{"$error":"#VALUE!"},{"$error":"#VALUE!"},0,{"$error":"#VALUE!"},{"$f":"IF(S73<='Collection System Summary_Table'!$I$8,\"Yes\",\"NO\")","v":"Yes"}]
[null,null,null,null,null,null,null,null,null,null,null,null,0,{"$error":"#VALUE!"},{"$error":"#VALUE!"},0,{"$error":"#VALUE!"},{"$error":"#VALUE!"},0,{"$error":"#VALUE!"},{"$f":"IF(S74<='Collection System Summary_Table'!$I$8,\"Yes\",\"NO\")","v":"Yes"}]
[null,null,null,null,null,null,null,null,null,null,null,null,0,{"$error":"#VALUE!"},{"$error":"#VALUE!"},0,{"$error":"#VALUE!"},{"$error":"#VALUE!"},0,{"$error":"#VALUE!"},{"$f":"IF(S75<='Collection System Summary_Table'!$I$8,\"Yes\",\"NO\")","v":"Yes"}]
[null,null,null,null,null,null,null,null,null,null,null,null,0,{"$error":"#VALUE!"},{"$error":"#VALUE!"},0,{"$error":"#VALUE!"},{"$error":"#VALUE!"},0,{"$error":"#VALUE!"},{"$f":"IF(S76<='Collection System Summary_Table'!$I$8,\"Yes\",\"NO\")","v":"Yes"}]
[null,null,null,null,null,null,null,null,null,null,null,null,0,{"$error":"#VALUE!"},{"$error":"#VALUE!"},0,{"$error":"#VALUE!"},{"$error":"#VALUE!"},0,{"$error":"#VALUE!"},{"$f":"IF(S77<='Collection System Summary_Table'!$I$8,\"Yes\",\"NO\")","v":"Yes"}]
[null,null,null,null,null,null,null,null,null,null,null,null,0,{"$error":"#VALUE!"},{"$error":"#VALUE!"},0,{"$error":"#VALUE!"},{"$error":"#VALUE!"},0,{"$error":"#VALUE!"},{"$f":"IF(S78<='Collection System Summary_Table'!$I$8,\"Yes\",\"NO\")","v":"Yes"}]
[null,null,null,null,null,null,null,null,null,null,null,null,0,{"$error":"#VALUE!"},{"$error":"#VALUE!"},0,{"$error":"#VALUE!"},{"$error":"#VALUE!"},0,{"$error":"#VALUE!"},{"$f":"IF(S79<='Collection System Summary_Table'!$I$8,\"Yes\",\"NO\")","v":"Yes"}]
[null,null,null,null,null,null,null,null,null,null,null,null,0,{"$error":"#VALUE!"},{"$error":"#VALUE!"},0,{"$error":"#VALUE!"},{"$error":"#VALUE!"},0,{"$error":"#VALUE!"},{"$f":"IF(S80<='Collection System Summary_Table'!$I$8,\"Yes\",\"NO\")","v":"Yes"}]
[null,null,null,null,null,null,null,null,null,null,null,null,0,{"$error":"#VALUE!"},{"$error":"#VALUE!"},0,{"$error":"#VALUE!"},{"$error":"#VALUE!"},0,{"$error":"#VALUE!"},{"$f":"IF(S81<='Collection System Summary_Table'!$I$8,\"Yes\",\"NO\")","v":"Yes"}]
[null,null,null,null,null,null,null,null,null,null,null,null,0,{"$error":"#VALUE!"},{"$error":"#VALUE!"},0,{"$error":"#VALUE!"},{"$error":"#VALUE!"},0,{"$error":"#VALUE!"},{"$f":"IF(S82<='Collection System Summary_Table'!$I$8,\"Yes\",\"NO\")","v":"Yes"}]
[null,null,null,null,null,null,null,null,null,null,null,null,0,{"$error":"#VALUE!"},{"$error":"#VALUE!"},0,{"$error":"#VALUE!"},{"$error":"#VALUE!"},0,{"$error":"#VALUE!"},{"$f":"IF(S83<='Collection System Summary_Table'!$I$8,\"Yes\",\"NO\")","v":"Yes"}]
[null,null,null,null,null,null,null,null,null,null,null,null,0,{"$error":"#VALUE!"},{"$error":"#VALUE!"},0,{"$error":"#VALUE!"},{"$error":"#VALUE!"},0,{"$error":"#VALUE!"},{"$f":"IF(S84<='Collection System Summary_Table'!$I$8,\"Yes\",\"NO\")","v":"Yes"}]
[null,null,null,null,null,null,null,null,null,null,null,null,0,{"$error":"#VALUE!"},{"$error":"#VALUE!"},0,{"$error":"#VALUE!"},{"$error":"#VALUE!"},0,{"$error":"#VALUE!"},{"$f":"IF(S85<='Collection System Summary_Table'!$I$8,\"Yes\",\"NO\")","v":"Yes"}]
[null,null,null,null,null,null,null,null,null,null,null,null,0,{"$error":"#VALUE!"},{"$error":"#VALUE!"},0,{"$error":"#VALUE!"},{"$error":"#VALUE!"},0,{"$error":"#VALUE!"},{"$f":"IF(S86<='Collection System Summary_Table'!$I$8,\"Yes\",\"NO\")","v":"Yes"}]
[null,null,null,null,null,null,null,null,null,null,null,null,0,{"$error":"#VALUE!"},{"$error":"#VALUE!"},0,{"$error":"#VALUE!"},{"$error":"#VALUE!"},0,{"$error":"#VALUE!"},{"$f":"IF(S87<='Collection System Summary_Table'!$I$8,\"Yes\",\"NO\")","v":"Yes"}]
[null,null,null,null,null,null,null,null,null,null,null,null,0,{"$error":"#VALUE!"},{"$error":"#VALUE!"},0,{"$error":"#VALUE!"},{"$error":"#VALUE!"},0,{"$error":"#VALUE!"},{"$f":"IF(S88<='Collection System Summary_Table'!$I$8,\"Yes\",\"NO\")","v":"Yes"}]
[null,null,null,null,null,null,null,null,null,null,null,null,0,{"$error":"#VALUE!"},{"$error":"#VALUE!"},0,{"$error":"#VALUE!"},{"$error":"#VALUE!"},0,{"$error":"#VALUE!"},{"$f":"IF(S89<='Collection System Summary_Table'!$I$8,\"Yes\",\"NO\")","v":"Yes"}]
[null,null,null,null,null,null,null,null,null,null,null,null,0,{"$error":"#VALUE!"},{"$error":"#VALUE!"},0,{"$error":"#VALUE!"},{"$error":"#VALUE!"},0,{"$error":"#VALUE!"},{"$f":"IF(S90<='Collection System Summary_Table'!$I$8,\"Yes\",\"NO\")","v":"Yes"}]
[null,null,null,null,null,null,null,null,null,null,null,null,0,{"$error":"#VALUE!"},{"$error":"#VALUE!"},0,{"$error":"#VALUE!"},{"$error":"#VALUE!"},0,{"$error":"#VALUE!"},{"$f":"IF(S91<='Collection System Summary_Table'!$I$8,\"Yes\",\"NO\")","v":"Yes"}]
[null,null,null,null,null,null,null,null,null,null,null,null,0,{"$error":"#VALUE!"},{"$error":"#VALUE!"},0,{"$error":"#VALUE!"},{"$error":"#VALUE!"},0,{"$error":"#VALUE!"},{"$f":"IF(S92<='Collection System Summary_Table'!$I$8,\"Yes\",\"NO\")","v":"Yes"}]
[null,null,null,null,null,null,null,null,null,null,null,null,0,{"$error":"#VALUE!"},{"$error":"#VALUE!"},0,{"$error":"#VALUE!"},{"$error":"#VALUE!"},0,{"$error":"#VALUE!"},{"$f":"IF(S93<='Collection System Summary_Table'!$I$8,\"Yes\",\"NO\")","v":"Yes"}]
[null,null,null,null,null,null,null,null,null,null,null,null,0,{"$error":"#VALUE!"},{"$error":"#VALUE!"},0,{"$error":"#VALUE!"},{"$error":"#VALUE!"},0,{"$error":"#VALUE!"},{"$f":"IF(S94<='Collection System Summary_Table'!$I$8,\"Yes\",\"NO\")","v":"Yes"}]
[null,null,null,null,null,null,null,null,null,null,null,null,0,{"$error":"#VALUE!"},{"$error":"#VALUE!"},0,{"$error":"#VALUE!"},{"$error":"#VALUE!"},0,{"$error":"#VALUE!"},{"$f":"IF(S95<='Collection System Summary_Table'!$I$8,\"Yes\",\"NO\")","v":"Yes"}]
[null,null,null,null,null,null,null,null,null,null,null,null,0,{"$error":"#VALUE!"},{"$error":"#VALUE!"},0,{"$error":"#VALUE!"},{"$error":"#VALUE!"},0,{"$error":"#VALUE!"},{"$f":"IF(S96<='Collection System Summary_Table'!$I$8,\"Yes\",\"NO\")","v":"Yes"}]
[null,null,null,null,null,null,null,null,null,null,null,null,0,{"$error":"#VALUE!"},{"$error":"#VALUE!"},0,{"$error":"#VALUE!"},{"$error":"#VALUE!"},0,{"$error":"#VALUE!"},{"$f":"IF(S97<='Collection System Summary_Table'!$I$8,\"Yes\",\"NO\")","v":"Yes"}]
[null,null,null,null,null,null,null,null,null,null,null,null,0,{"$error":"#VALUE!"},{"$error":"#VALUE!"},0,{"$error":"#VALUE!"},{"$error":"#VALUE!"},0,{"$error":"#VALUE!"},{"$f":"IF(S98<='Collection System Summary_Table'!$I$8,\"Yes\",\"NO\")","v":"Yes"}]
[null,null,null,null,null,null,null,null,null,null,null,null,0,{"$error":"#VALUE!"},{"$error":"#VALUE!"},0,{"$error":"#VALUE!"},{"$error":"#VALUE!"},0,{"$error":"#VALUE!"},{"$f":"IF(S99<='Collection System Summary_Table'!$I$8,\"Yes\",\"NO\")","v":"Yes"}]
[null,null,null,null,null,null,null,null,null,null,null,null,0,{"$error":"#VALUE!"},{"$error":"#VALUE!"},0,{"$error":"#VALUE!"},{"$error":"#VALUE!"},0,{"$error":"#VALUE!"},{"$f":"IF(S100<='Collection System Summary_Table'!$I$8,\"Yes\",\"NO\")","v":"Yes"}]
[null,null,null,null,null,null,null,null,null,null,null,null,0,{"$error":"#VALUE!"},{"$error":"#VALUE!"},0,{"$error":"#VALUE!"},{"$error":"#VALUE!"},0,{"$error":"#VALUE!"},{"$f":"IF(S101<='Collection System Summary_Table'!$I$8,\"Yes\",\"NO\")","v":"Yes"}]
[null,null,null,null,null,null,null,null,null,null,null,null,0,{"$error":"#VALUE!"},{"$error":"#VALUE!"},0,{"$error":"#VALUE!"},{"$error":"#VALUE!"},0,{"$error":"#VALUE!"},{"$f":"IF(S102<='Collection System Summary_Table'!$I$8,\"Yes\",\"NO\")","v":"Yes"}]
[null,null,null,null,null,null,null,null,null,null,null,null,0,{"$error":"#VALUE!"},{"$error":"#VALUE!"},0,{"$error":"#VALUE!"},{"$error":"#VALUE!"},0,{"$error":"#VALUE!"},{"$f":"IF(S103<='Collection System Summary_Table'!$I$8,\"Yes\",\"NO\")","v":"Yes"}]
[null,null,null,null,null,null,null,null,null,null,null,null,0,{"$error":"#VALUE!"},{"$error":"#VALUE!"},0,{"$error":"#VALUE!"},{"$error":"#VALUE!"},0,{"$error":"#VALUE!"},{"$f":"IF(S104<='Collection System Summary_Table'!$I$8,\"Yes\",\"NO\")","v":"Yes"}]
[null,null,null,null,null,null,null,null,null,null,null,null,0,{"$error":"#VALUE!"},{"$error":"#VALUE!"},0,{"$error":"#VALUE!"},{"$error":"#VALUE!"},0,{"$error":"#VALUE!"},{"$f":"IF(S105<='Collection System Summary_Table'!$I$8,\"Yes\",\"NO\")","v":"Yes"}]
[null,null,null,null,null,null,null,null,null,null,null,null,0,{"$error":"#VALUE!"},{"$error":"#VALUE!"},0,{"$error":"#VALUE!"},{"$error":"#VALUE!"},0,{"$error":"#VALUE!"},{"$f":"IF(S106<='Collection System Summary_Table'!$I$8,\"Yes\",\"NO\")","v":"Yes"}]
[null,null,null,null,null,null,null,null,null,null,null,null,0,{"$error":"#VALUE!"},{"$error":"#VALUE!"},0,{"$error":"#VALUE!"},{"$error":"#VALUE!"},0,{"$error":"#VALUE!"},{"$f":"IF(S107<='Collection System Summary_Table'!$I$8,\"Yes\",\"NO\")","v":"Yes"}]
[null,null,null,null,null,null,null,null,null,null,null,null,0,{"$error":"#VALUE!"},{"$error":"#VALUE!"},0,{"$error":"#VALUE!"},{"$error":"#VALUE!"},0,{"$error":"#VALUE!"},{"$f":"IF(S108<='Collection System Summary_Table'!$I$8,\"Yes\",\"NO\")","v":"Yes"}]
[null,null,null,null,null,null,null,null,null,null,null,null,0,{"$error":"#VALUE!"},{"$error":"#VALUE!"},0,{"$error":"#VALUE!"},{"$error":"#VALUE!"},0,{"$error":"#VALUE!"},{"$f":"IF(S109<='Collection System Summary_Table'!$I$8,\"Yes\",\"NO\")","v":"Yes"}]
[null,null,null,null,null,null,null,null,null,null,null,null,0,{"$error":"#VALUE!"},{"$error":"#VALUE!"},0,{"$error":"#VALUE!"},{"$error":"#VALUE!"},0,{"$error":"#VALUE!"},{"$f":"IF(S110<='Collection System Summary_Table'!$I$8,\"Yes\",\"NO\")","v":"Yes"}]
[null,null,null,null,null,null,null,null,null,null,null,null,0,{"$error":"#VALUE!"},{"$error":"#VALUE!"},0,{"$error":"#VALUE!"},{"$error":"#VALUE!"},0,{"$error":"#VALUE!"},{"$f":"IF(S111<='Collection System Summary_Table'!$I$8,\"Yes\",\"NO\")","v":"Yes"}]
[null,null,null,null,null,null,null,null,null,null,null,null,0,{"$error":"#VALUE!"},{"$error":"#VALUE!"},0,{"$error":"#VALUE!"},{"$error":"#VALUE!"},0,{"$error":"#VALUE!"},{"$f":"IF(S112<='Collection System Summary_Table'!$I$8,\"Yes\",\"NO\")","v":"Yes"}]
[null,null,null,null,null,null,null,null,null,null,null,null,0,{"$error":"#VALUE!"},{"$error":"#VALUE!"},0,{"$error":"#VALUE!"},{"$error":"#VALUE!"},0,{"$error":"#VALUE!"},{"$f":"IF(S113<='Collection System Summary_Table'!$I$8,\"Yes\",\"NO\")","v":"Yes"}]
[null,null,null,null,null,null,null,null,null,null,null,null,0,{"$error":"#VALUE!"},{"$error":"#VALUE!"},0,{"$error":"#VALUE!"},{"$error":"#VALUE!"},0,{"$error":"#VALUE!"},{"$f":"IF(S114<='Collection System Summary_Table'!$I$8,\"Yes\",\"NO\")","v":"Yes"}]
[null,null,null,null,null,null,null,null,null,null,null,null,0,{"$error":"#VALUE!"},{"$error":"#VALUE!"},0,{"$error":"#VALUE!"},{"$error":"#VALUE!"},0,{"$error":"#VALUE!"},{"$f":"IF(S115<='Collection System Summary_Table'!$I$8,\"Yes\",\"NO\")","v":"Yes"}]
[null,null,null,null,null,null,null,null,null,null,null,null,0,{"$error":"#VALUE!"},{"$error":"#VALUE!"},0,{"$error":"#VALUE!"},{"$error":"#VALUE!"},0,{"$error":"#VALUE!"},{"$f":"IF(S116<='Collection System Summary_Table'!$I$8,\"Yes\",\"NO\")","v":"Yes"}]
[null,null,null,null,null,null,null,null,null,null,null,null,0,{"$error":"#VALUE!"},{"$error":"#VALUE!"},0,{"$error":"#VALUE!"},{"$error":"#VALUE!"},0,{"$error":"#VALUE!"},{"$f":"IF(S117<='Collection System Summary_Table'!$I$8,\"Yes\",\"NO\")","v":"Yes"}]
[null,null,null,null,null,null,null,null,null,null,null,null,0,{"$error":"#VALUE!"},{"$error":"#VALUE!"},0,{"$error":"#VALUE!"},{"$error":"#VALUE!"},0,{"$error":"#VALUE!"},{"$f":"IF(S118<='Collection System Summary_Table'!$I$8,\"Yes\",\"NO\")","v":"Yes"}]
[null,null,null,null,null,null,null,null,null,null,null,null,0,{"$error":"#VALUE!"},{"$error":"#VALUE!"},0,{"$error":"#VALUE!"},{"$error":"#VALUE!"},0,{"$error":"#VALUE!"},{"$f":"IF(S119<='Collection System Summary_Table'!$I$8,\"Yes\",\"NO\")","v":"Yes"}]
[null,null,null,null,null,null,null,null,null,null,null,null,0,{"$error":"#VALUE!"},{"$error":"#VALUE!"},0,{"$error":"#VALUE!"},{"$error":"#VALUE!"},0,{"$error":"#VALUE!"},{"$f":"IF(S120<='Collection System Summary_Table'!$I$8,\"Yes\",\"NO\")","v":"Yes"}]
[null,null,null,null,null,null,null,null,null,null,null,null,0,{"$error":"#VALUE!"},{"$error":"#VALUE!"},0,{"$error":"#VALUE!"},{"$error":"#VALUE!"},0,{"$error":"#VALUE!"},{"$f":"IF(S121<='Collection System Summary_Table'!$I$8,\"Yes\",\"NO\")","v":"Yes"}]
[null,null,null,null,null,null,null,null,null,null,null,null,0,{"$error":"#VALUE!"},{"$error":"#VALUE!"},0,{"$error":"#VALUE!"},{"$error":"#VALUE!"},0,{"$error":"#VALUE!"},{"$f":"IF(S122<='Collection System Summary_Table'!$I$8,\"Yes\",\"NO\")","v":"Yes"}]
[null,null,null,null,null,null,null,null,null,null,null,null,0,{"$error":"#VALUE!"},{"$error":"#VALUE!"},0,{"$error":"#VALUE!"},{"$error":"#VALUE!"},0,{"$error":"#VALUE!"},{"$f":"IF(S123<='Collection System Summary_Table'!$I$8,\"Yes\",\"NO\")","v":"Yes"}]
[null,null,null,null,null,null,null,null,null,null,null,null,0,{"$error":"#VALUE!"},{"$error":"#VALUE!"},0,{"$error":"#VALUE!"},{"$error":"#VALUE!"},0,{"$error":"#VALUE!"},{"$f":"IF(S124<='Collection System Summary_Table'!$I$8,\"Yes\",\"NO\")","v":"Yes"}]
[null,null,null,null,null,null,null,null,null,null,null,null,0,{"$error":"#VALUE!"},{"$error":"#VALUE!"},0,{"$error":"#VALUE!"},{"$error":"#VALUE!"},0,{"$error":"#VALUE!"},{"$f":"IF(S125<='Collection System Summary_Table'!$I$8,\"Yes\",\"NO\")","v":"Yes"}]
[null,null,null,null,null,null,null,null,null,null,null,null,0,{"$error":"#VALUE!"},{"$error":"#VALUE!"},0,{"$error":"#VALUE!"},{"$error":"#VALUE!"},0,{"$error":"#VALUE!"},{"$f":"IF(S126<='Collection System Summary_Table'!$I$8,\"Yes\",\"NO\")","v":"Yes"}]
[null,null,null,null,null,null,null,null,null,null,null,null,0,{"$error":"#VALUE!"},{"$error":"#VALUE!"},0,{"$error":"#VALUE!"},{"$error":"#VALUE!"},0,{"$error":"#VALUE!"},{"$f":"IF(S127<='Collection System Summary_Table'!$I$8,\"Yes\",\"NO\")","v":"Yes"}]
[null,null,null,null,null,null,null,null,null,null,null,null,0,{"$error":"#VALUE!"},{"$error":"#VALUE!"},0,{"$error":"#VALUE!"},{"$error":"#VALUE!"},0,{"$error":"#VALUE!"},{"$f":"IF(S128<='Collection System Summary_Table'!$I$8,\"Yes\",\"NO\")","v":"Yes"}]
[null,null,null,null,null,null,null,null,null,null,null,null,0,{"$error":"#VALUE!"},{"$error":"#VALUE!"},0,{"$error":"#VALUE!"},{"$error":"#VALUE!"},0,{"$error":"#VALUE!"},{"$f":"IF(S129<='Collection System Summary_Table'!$I$8,\"Yes\",\"NO\")","v":"Yes"}]
[null,null,null,null,null,null,null,null,null,null,null,null,0,{"$error":"#VALUE!"},{"$error":"#VALUE!"},0,{"$error":"#VALUE!"},{"$error":"#VALUE!"},0,{"$error":"#VALUE!"},{"$f":"IF(S130<='Collection System Summary_Table'!$I$8,\"Yes\",\"NO\")","v":"Yes"}]
[null,null,null,null,null,null,null,null,null,null,null,null,0,{"$f":"IF(P131=0,I131+N130,0)","v":{"$error":"#VALUE!"}},{"$error":"#VALUE!"},0,{"$error":"#VALUE!"},{"$error":"#VALUE!"},0,{"$error":"#VALUE!"},{"$f":"IF(S131<='Collection System Summary_Table'!$I$8,\"Yes\",\"NO\")","v":"Yes"}]
[null,null,null,null,null,null,null,null,null,null,null,null,0,{"$error":"#VALUE!"},{"$f":"IF(AND(Q132=0,P132=0),K132+O131,0)","v":{"$error":"#VALUE!"}},0,{"$f":"IF(AND(P132=0,N132<($B$4+$P$1)),J132,0)","v":{"$error":"#VALUE!"}},{"$f":"IF(AND(P132=0,Q132=0,O132<($B$5+$Q$1)),K132,0)","v":{"$error":"#VALUE!"}},{"$f":"S131+L132","v":0},{"$f":"IF(OR(P132>1,Q132>1,R132>1),\"YES\",\"NO\")","v":{"$error":"#VALUE!"}},{"$f":"IF(S132<='Collection System Summary_Table'!$I$8,\"Yes\",\"NO\")","v":"Yes"}]
[null,null,null,null,null,null,null,null,null,null,null,null,{"$f":"M132+I133","v":0},{"$error":"#VALUE!"},{"$error":"#VALUE!"},{"$f":"IF(M133<=$B$3,I133,0)","v":0},{"$error":"#VALUE!"},{"$error":"#VALUE!"},0,{"$error":"#VALUE!"},{"$f":"IF(S133<='Collection System Summary_Table'!$I$8,\"Yes\",\"NO\")","v":"Yes"}]
[null,null,null,null,null,null,null,null,null,null,null,null,0,{"$error":"#VALUE!"},{"$error":"#VALUE!"},0,{"$error":"#VALUE!"},{"$error":"#VALUE!"},0,{"$error":"#VALUE!"},{"$f":"IF(S134<='Collection System Summary_Table'!$I$8,\"Yes\",\"NO\")","v":"Yes"}]
[null,null,null,null,null,null,null,null,null,null,null,null,0,{"$error":"#VALUE!"},{"$error":"#VALUE!"},0,{"$error":"#VALUE!"},{"$error":"#VALUE!"},0,{"$error":"#VALUE!"},{"$f":"IF(S135<='Collection System Summary_Table'!$I$8,\"Yes\",\"NO\")","v":"Yes"}]
[null,null,null,null,null,null,null,null,null,null,null,null,0,{"$error":"#VALUE!"},{"$error":"#VALUE!"},0,{"$error":"#VALUE!"},{"$error":"#VALUE!"},0,{"$error":"#VALUE!"},{"$f":"IF(S136<='Collection System Summary_Table'!$I$8,\"Yes\",\"NO\")","v":"Yes"}]
[null,null,null,null,null,null,null,null,null,null,null,null,0,{"$error":"#VALUE!"},{"$error":"#VALUE!"},0,{"$error":"#VALUE!"},{"$error":"#VALUE!"},0,{"$error":"#VALUE!"},{"$f":"IF(S137<='Collection System Summary_Table'!$I$8,\"Yes\",\"NO\")","v":"Yes"}]
[null,null,null,null,null,null,null,null,null,null,null,null,0,{"$error":"#VALUE!"},{"$error":"#VALUE!"},0,{"$error":"#VALUE!"},{"$error":"#VALUE!"},0,{"$error":"#VALUE!"},{"$f":"IF(S138<='Collection System Summary_Table'!$I$8,\"Yes\",\"NO\")","v":"Yes"}]
[null,null,null,null,null,null,null,null,null,null,null,null,0,{"$error":"#VALUE!"},{"$error":"#VALUE!"},0,{"$error":"#VALUE!"},{"$error":"#VALUE!"},0,{"$error":"#VALUE!"},{"$f":"IF(S139<='Collection System Summary_Table'!$I$8,\"Yes\",\"NO\")","v":"Yes"}]
[null,null,null,null,null,null,null,null,null,null,null,null,0,{"$error":"#VALUE!"},{"$error":"#VALUE!"},0,{"$error":"#VALUE!"},{"$error":"#VALUE!"},0,{"$error":"#VALUE!"},{"$f":"IF(S140<='Collection System Summary_Table'!$I$8,\"Yes\",\"NO\")","v":"Yes"}]
[null,null,null,null,null,null,null,null,null,null,null,null,0,{"$error":"#VALUE!"},{"$error":"#VALUE!"},0,{"$error":"#VALUE!"},{"$error":"#VALUE!"},0,{"$error":"#VALUE!"},{"$f":"IF(S141<='Collection System Summary_Table'!$I$8,\"Yes\",\"NO\")","v":"Yes"}]
[null,null,null,null,null,null,null,null,null,null,null,null,0,{"$error":"#VALUE!"},{"$error":"#VALUE!"},0,{"$error":"#VALUE!"},{"$error":"#VALUE!"},0,{"$error":"#VALUE!"},{"$f":"IF(S142<='Collection System Summary_Table'!$I$8,\"Yes\",\"NO\")","v":"Yes"}]
[null,null,null,null,null,null,null,null,null,null,null,null,0,{"$error":"#VALUE!"},{"$error":"#VALUE!"},0,{"$error":"#VALUE!"},{"$error":"#VALUE!"},0,{"$error":"#VALUE!"},{"$f":"IF(S143<='Collection System Summary_Table'!$I$8,\"Yes\",\"NO\")","v":"Yes"}]
[null,null,null,null,null,null,null,null,null,null,null,null,0,{"$error":"#VALUE!"},{"$error":"#VALUE!"},0,{"$error":"#VALUE!"},{"$error":"#VALUE!"},0,{"$error":"#VALUE!"},{"$f":"IF(S144<='Collection System Summary_Table'!$I$8,\"Yes\",\"NO\")","v":"Yes"}]
[null,null,null,null,null,null,null,null,null,null,null,null,0,{"$error":"#VALUE!"},{"$error":"#VALUE!"},0,{"$error":"#VALUE!"},{"$error":"#VALUE!"},0,{"$error":"#VALUE!"},{"$f":"IF(S145<='Collection System Summary_Table'!$I$8,\"Yes\",\"NO\")","v":"Yes"}]
[null,null,null,null,null,null,null,null,null,null,null,null,0,{"$error":"#VALUE!"},{"$error":"#VALUE!"},0,{"$error":"#VALUE!"},{"$error":"#VALUE!"},0,{"$error":"#VALUE!"},{"$f":"IF(S146<='Collection System Summary_Table'!$I$8,\"Yes\",\"NO\")","v":"Yes"}]
[null,null,null,null,null,null,null,null,null,null,null,null,0,{"$error":"#VALUE!"},{"$error":"#VALUE!"},0,{"$error":"#VALUE!"},{"$error":"#VALUE!"},0,{"$error":"#VALUE!"},{"$f":"IF(S147<='Collection System Summary_Table'!$I$8,\"Yes\",\"NO\")","v":"Yes"}]
[null,null,null,null,null,null,null,null,null,null,null,null,0,{"$error":"#VALUE!"},{"$error":"#VALUE!"},0,{"$error":"#VALUE!"},{"$error":"#VALUE!"},0,{"$error":"#VALUE!"},{"$f":"IF(S148<='Collection System Summary_Table'!$I$8,\"Yes\",\"NO\")","v":"Yes"}]
[null,null,null,null,null,null,null,null,null,null,null,null,0,{"$error":"#VALUE!"},{"$error":"#VALUE!"},0,{"$error":"#VALUE!"},{"$error":"#VALUE!"},0,{"$error":"#VALUE!"},{"$f":"IF(S149<='Collection System Summary_Table'!$I$8,\"Yes\",\"NO\")","v":"Yes"}]
[null,null,null,null,null,null,null,null,null,null,null,null,0,{"$error":"#VALUE!"},{"$error":"#VALUE!"},0,{"$error":"#VALUE!"},{"$error":"#VALUE!"},0,{"$error":"#VALUE!"},{"$f":"IF(S150<='Collection System Summary_Table'!$I$8,\"Yes\",\"NO\")","v":"Yes"}]
[null,null,null,null,null,null,null,null,null,null,null,null,0,{"$error":"#VALUE!"},{"$error":"#VALUE!"},0,{"$error":"#VALUE!"},{"$error":"#VALUE!"},0,{"$error":"#VALUE!"},{"$f":"IF(S151<='Collection System Summary_Table'!$I$8,\"Yes\",\"NO\")","v":"Yes"}]
[null,null,null,null,null,null,null,null,null,null,null,null,0,{"$error":"#VALUE!"},{"$error":"#VALUE!"},0,{"$error":"#VALUE!"},{"$error":"#VALUE!"},0,{"$error":"#VALUE!"},{"$f":"IF(S152<='Collection System Summary_Table'!$I$8,\"Yes\",\"NO\")","v":"Yes"}]
[null,null,null,null,null,null,null,null,null,null,null,null,0,{"$error":"#VALUE!"},{"$error":"#VALUE!"},0,{"$error":"#VALUE!"},{"$error":"#VALUE!"},0,{"$error":"#VALUE!"},{"$f":"IF(S153<='Collection System Summary_Table'!$I$8,\"Yes\",\"NO\")","v":"Yes"}]
[null,null,null,null,null,null,null,null,null,null,null,null,0,{"$error":"#VALUE!"},{"$error":"#VALUE!"},0,{"$error":"#VALUE!"},{"$error":"#VALUE!"},0,{"$error":"#VALUE!"},{"$f":"IF(S154<='Collection System Summary_Table'!$I$8,\"Yes\",\"NO\")","v":"Yes"}]
[null,null,null,null,null,null,null,null,null,null,null,null,0,{"$error":"#VALUE!"},{"$error":"#VALUE!"},0,{"$error":"#VALUE!"},{"$error":"#VALUE!"},0,{"$error":"#VALUE!"},{"$f":"IF(S155<='Collection System Summary_Table'!$I$8,\"Yes\",\"NO\")","v":"Yes"}]
[null,null,null,null,null,null,null,null,null,null,null,null,0,{"$error":"#VALUE!"},{"$error":"#VALUE!"},0,{"$error":"#VALUE!"},{"$error":"#VALUE!"},0,{"$error":"#VALUE!"},{"$f":"IF(S156<='Collection System Summary_Table'!$I$8,\"Yes\",\"NO\")","v":"Yes"}]
[null,null,null,null,null,null,null,null,null,null,null,null,0,{"$error":"#VALUE!"},{"$error":"#VALUE!"},0,{"$error":"#VALUE!"},{"$error":"#VALUE!"},0,{"$error":"#VALUE!"},{"$f":"IF(S157<='Collection System Summary_Table'!$I$8,\"Yes\",\"NO\")","v":"Yes"}]
[null,null,null,null,null,null,null,null,null,null,null,null,0,{"$error":"#VALUE!"},{"$error":"#VALUE!"},0,{"$error":"#VALUE!"},{"$error":"#VALUE!"},0,{"$error":"#VALUE!"},{"$f":"IF(S158<='Collection System Summary_Table'!$I$8,\"Yes\",\"NO\")","v":"Yes"}]
[null,null,null,null,null,null,null,null,null,null,null,null,0,{"$error":"#VALUE!"},{"$error":"#VALUE!"},0,{"$error":"#VALUE!"},{"$error":"#VALUE!"},0,{"$error":"#VALUE!"},{"$f":"IF(S159<='Collection System Summary_Table'!$I$8,\"Yes\",\"NO\")","v":"Yes"}]
[null,null,null,null,null,null,null,null,null,null,null,null,0,{"$error":"#VALUE!"},{"$error":"#VALUE!"},0,{"$error":"#VALUE!"},{"$error":"#VALUE!"},0,{"$error":"#VALUE!"},{"$f":"IF(S160<='Collection System Summary_Table'!$I$8,\"Yes\",\"NO\")","v":"Yes"}]
[null,null,null,null,null,null,null,null,null,null,null,null,0,{"$error":"#VALUE!"},{"$error":"#VALUE!"},0,{"$error":"#VALUE!"},{"$error":"#VALUE!"},0,{"$error":"#VALUE!"},{"$f":"IF(S161<='Collection System Summary_Table'!$I$8,\"Yes\",\"NO\")","v":"Yes"}]
[null,null,null,null,null,null,null,null,null,null,null,null,0,{"$error":"#VALUE!"},{"$f":"IF(AND(Q162=0,P162=0),K162+O161,0)","v":{"$error":"#VALUE!"}},0,{"$error":"#VALUE!"},{"$error":"#VALUE!"},0,{"$error":"#VALUE!"},{"$f":"IF(S162<='Collection System Summary_Table'!$I$8,\"Yes\",\"NO\")","v":"Yes"}]
[null,null,null,null,null,null,null,null,null,null,null,null,0,{"$error":"#VALUE!"},{"$error":"#VALUE!"},0,{"$error":"#VALUE!"},{"$error":"#VALUE!"},0,{"$error":"#VALUE!"},{"$f":"IF(S163<='Collection System Summary_Table'!$I$8,\"Yes\",\"NO\")","v":"Yes"}]
[null,null,null,null,null,null,null,null,null,null,null,null,0,{"$error":"#VALUE!"},{"$error":"#VALUE!"},0,{"$error":"#VALUE!"},{"$error":"#VALUE!"},0,{"$error":"#VALUE!"},{"$f":"IF(S164<='Collection System Summary_Table'!$I$8,\"Yes\",\"NO\")","v":"Yes"}]
[null,null,null,null,null,null,null,null,null,null,null,null,0,{"$error":"#VALUE!"},{"$error":"#VALUE!"},0,{"$error":"#VALUE!"},{"$error":"#VALUE!"},0,{"$error":"#VALUE!"},{"$f":"IF(S165<='Collection System Summary_Table'!$I$8,\"Yes\",\"NO\")","v":"Yes"}]
[null,null,null,null,null,null,null,null,null,null,null,null,0,{"$error":"#VALUE!"},{"$error":"#VALUE!"},0,{"$error":"#VALUE!"},{"$error":"#VALUE!"},0,{"$error":"#VALUE!"},{"$f":"IF(S166<='Collection System Summary_Table'!$I$8,\"Yes\",\"NO\")","v":"Yes"}]
[null,null,null,null,null,null,null,null,null,null,null,null,0,{"$error":"#VALUE!"},{"$error":"#VALUE!"},0,{"$error":"#VALUE!"},{"$error":"#VALUE!"},0,{"$error":"#VALUE!"},{"$f":"IF(S167<='Collection System Summary_Table'!$I$8,\"Yes\",\"NO\")","v":"Yes"}]
[null,null,null,null,null,null,null,null,null,null,null,null,0,{"$error":"#VALUE!"},{"$error":"#VALUE!"},0,{"$error":"#VALUE!"},{"$error":"#VALUE!"},0,{"$error":"#VALUE!"},{"$f":"IF(S168<='Collection System Summary_Table'!$I$8,\"Yes\",\"NO\")","v":"Yes"}]
[null,null,null,null,null,null,null,null,null,null,null,null,0,{"$error":"#VALUE!"},{"$error":"#VALUE!"},0,{"$error":"#VALUE!"},{"$error":"#VALUE!"},0,{"$error":"#VALUE!"},{"$f":"IF(S169<='Collection System Summary_Table'!$I$8,\"Yes\",\"NO\")","v":"Yes"}]
[null,null,null,null,null,null,null,null,null,null,null,null,0,{"$error":"#VALUE!"},{"$error":"#VALUE!"},0,{"$error":"#VALUE!"},{"$error":"#VALUE!"},0,{"$error":"#VALUE!"},{"$f":"IF(S170<='Collection System Summary_Table'!$I$8,\"Yes\",\"NO\")","v":"Yes"}]
[null,null,null,null,null,null,null,null,null,null,null,null,0,{"$error":"#VALUE!"},{"$error":"#VALUE!"},0,{"$error":"#VALUE!"},{"$error":"#VALUE!"},0,{"$error":"#VALUE!"},{"$f":"IF(S171<='Collection System Summary_Table'!$I$8,\"Yes\",\"NO\")","v":"Yes"}]
[null,null,null,null,null,null,null,null,null,null,null,null,0,{"$error":"#VALUE!"},{"$error":"#VALUE!"},0,{"$error":"#VALUE!"},{"$error":"#VALUE!"},0,{"$error":"#VALUE!"},{"$f":"IF(S172<='Collection System Summary_Table'!$I$8,\"Yes\",\"NO\")","v":"Yes"}]
[null,null,null,null,null,null,null,null,null,null,null,null,0,{"$error":"#VALUE!"},{"$error":"#VALUE!"},0,{"$error":"#VALUE!"},{"$error":"#VALUE!"},0,{"$error":"#VALUE!"},{"$f":"IF(S173<='Collection System Summary_Table'!$I$8,\"Yes\",\"NO\")","v":"Yes"}]
[null,null,null,null,null,null,null,null,null,null,null,null,0,{"$error":"#VALUE!"},{"$error":"#VALUE!"},0,{"$error":"#VALUE!"},{"$error":"#VALUE!"},0,{"$error":"#VALUE!"},{"$f":"IF(S174<='Collection System Summary_Table'!$I$8,\"Yes\",\"NO\")","v":"Yes"}]
[null,null,null,null,null,null,null,null,null,null,null,null,0,{"$error":"#VALUE!"},{"$error":"#VALUE!"},0,{"$error":"#VALUE!"},{"$error":"#VALUE!"},0,{"$error":"#VALUE!"},{"$f":"IF(S175<='Collection System Summary_Table'!$I$8,\"Yes\",\"NO\")","v":"Yes"}]
[null,null,null,null,null,null,null,null,null,null,null,null,0,{"$error":"#VALUE!"},{"$error":"#VALUE!"},0,{"$error":"#VALUE!"},{"$error":"#VALUE!"},0,{"$error":"#VALUE!"},{"$f":"IF(S176<='Collection System Summary_Table'!$I$8,\"Yes\",\"NO\")","v":"Yes"}]
[null,null,null,null,null,null,null,null,null,null,null,null,0,{"$error":"#VALUE!"},{"$error":"#VALUE!"},0,{"$error":"#VALUE!"},{"$error":"#VALUE!"},0,{"$error":"#VALUE!"},{"$f":"IF(S177<='Collection System Summary_Table'!$I$8,\"Yes\",\"NO\")","v":"Yes"}]
[null,null,null,null,null,null,null,null,null,null,null,null,0,{"$error":"#VALUE!"},{"$error":"#VALUE!"},0,{"$error":"#VALUE!"},{"$error":"#VALUE!"},0,{"$error":"#VALUE!"},{"$f":"IF(S178<='Collection System Summary_Table'!$I$8,\"Yes\",\"NO\")","v":"Yes"}]
[null,null,null,null,null,null,null,null,null,null,null,null,0,{"$error":"#VALUE!"},{"$error":"#VALUE!"},0,{"$error":"#VALUE!"},{"$error":"#VALUE!"},0,{"$error":"#VALUE!"},{"$f":"IF(S179<='Collection System Summary_Table'!$I$8,\"Yes\",\"NO\")","v":"Yes"}]
[null,null,null,null,null,null,null,null,null,null,null,null,0,{"$error":"#VALUE!"},{"$error":"#VALUE!"},0,{"$error":"#VALUE!"},{"$error":"#VALUE!"},0,{"$error":"#VALUE!"},{"$f":"IF(S180<='Collection System Summary_Table'!$I$8,\"Yes\",\"NO\")","v":"Yes"}]
[null,null,null,null,null,null,null,null,null,null,null,null,0,{"$error":"#VALUE!"},{"$error":"#VALUE!"},0,{"$error":"#VALUE!"},{"$error":"#VALUE!"},0,{"$error":"#VALUE!"},{"$f":"IF(S181<='Collection System Summary_Table'!$I$8,\"Yes\",\"NO\")","v":"Yes"}]
[null,null,null,null,null,null,null,null,null,null,null,null,0,{"$error":"#VALUE!"},{"$error":"#VALUE!"},0,{"$error":"#VALUE!"},{"$error":"#VALUE!"},0,{"$error":"#VALUE!"},{"$f":"IF(S182<='Collection System Summary_Table'!$I$8,\"Yes\",\"NO\")","v":"Yes"}]
[null,null,null,null,null,null,null,null,null,null,null,null,0,{"$error":"#VALUE!"},{"$error":"#VALUE!"},0,{"$error":"#VALUE!"},{"$error":"#VALUE!"},0,{"$error":"#VALUE!"},{"$f":"IF(S183<='Collection System Summary_Table'!$I$8,\"Yes\",\"NO\")","v":"Yes"}]
[null,null,null,null,null,null,null,null,null,null,null,null,0,{"$error":"#VALUE!"},{"$error":"#VALUE!"},0,{"$error":"#VALUE!"},{"$error":"#VALUE!"},0,{"$error":"#VALUE!"},{"$f":"IF(S184<='Collection System Summary_Table'!$I$8,\"Yes\",\"NO\")","v":"Yes"}]
[null,null,null,null,null,null,null,null,null,null,null,null,0,{"$error":"#VALUE!"},{"$error":"#VALUE!"},0,{"$error":"#VALUE!"},{"$error":"#VALUE!"},0,{"$error":"#VALUE!"},{"$f":"IF(S185<='Collection System Summary_Table'!$I$8,\"Yes\",\"NO\")","v":"Yes"}]
[null,null,null,null,null,null,null,null,null,null,null,null,0,{"$error":"#VALUE!"},{"$error":"#VALUE!"},0,{"$error":"#VALUE!"},{"$error":"#VALUE!"},0,{"$error":"#VALUE!"},{"$f":"IF(S186<='Collection System Summary_Table'!$I$8,\"Yes\",\"NO\")","v":"Yes"}]
[null,null,null,null,null,null,null,null,null,null,null,null,0,{"$error":"#VALUE!"},{"$error":"#VALUE!"},0,{"$error":"#VALUE!"},{"$error":"#VALUE!"},0,{"$error":"#VALUE!"},{"$f":"IF(S187<='Collection System Summary_Table'!$I$8,\"Yes\",\"NO\")","v":"Yes"}]
[null,null,null,null,null,null,null,null,null,null,null,null,0,{"$error":"#VALUE!"},{"$error":"#VALUE!"},0,{"$error":"#VALUE!"},{"$error":"#VALUE!"},0,{"$error":"#VALUE!"},{"$f":"IF(S188<='Collection System Summary_Table'!$I$8,\"Yes\",\"NO\")","v":"Yes"}]
[null,null,null,null,null,null,null,null,null,null,null,null,0,{"$error":"#VALUE!"},{"$error":"#VALUE!"},0,{"$error":"#VALUE!"},{"$error":"#VALUE!"},0,{"$error":"#VALUE!"},{"$f":"IF(S189<='Collection System Summary_Table'!$I$8,\"Yes\",\"NO\")","v":"Yes"}]
[null,null,null,null,null,null,null,null,null,null,null,null,0,{"$error":"#VALUE!"},{"$error":"#VALUE!"},0,{"$error":"#VALUE!"},{"$error":"#VALUE!"},0,{"$error":"#VALUE!"},{"$f":"IF(S190<='Collection System Summary_Table'!$I$8,\"Yes\",\"NO\")","v":"Yes"}]
[null,null,null,null,null,null,null,null,null,null,null,null,0,{"$error":"#VALUE!"},{"$error":"#VALUE!"},0,{"$error":"#VALUE!"},{"$error":"#VALUE!"},0,{"$error":"#VALUE!"},{"$f":"IF(S191<='Collection System Summary_Table'!$I$8,\"Yes\",\"NO\")","v":"Yes"}]
[null,null,null,null,null,null,null,null,null,null,null,null,0,{"$error":"#VALUE!"},{"$error":"#VALUE!"},0,{"$error":"#VALUE!"},{"$error":"#VALUE!"},0,{"$error":"#VALUE!"},{"$f":"IF(S192<='Collection System Summary_Table'!$I$8,\"Yes\",\"NO\")","v":"Yes"}]
[null,null,null,null,null,null,null,null,null,null,null,null,0,{"$error":"#VALUE!"},{"$error":"#VALUE!"},0,{"$error":"#VALUE!"},{"$error":"#VALUE!"},0,{"$error":"#VALUE!"},{"$f":"IF(S193<='Collection System Summary_Table'!$I$8,\"Yes\",\"NO\")","v":"Yes"}]
[null,null,null,null,null,null,null,null,null,null,null,null,0,{"$error":"#VALUE!"},{"$error":"#VALUE!"},0,{"$error":"#VALUE!"},{"$error":"#VALUE!"},0,{"$error":"#VALUE!"},{"$f":"IF(S194<='Collection System Summary_Table'!$I$8,\"Yes\",\"NO\")","v":"Yes"}]
[null,null,null,null,null,null,null,null,null,null,null,null,0,{"$f":"IF(P195=0,I195+N194,0)","v":{"$error":"#VALUE!"}},{"$error":"#VALUE!"},0,{"$error":"#VALUE!"},{"$error":"#VALUE!"},0,{"$error":"#VALUE!"},{"$f":"IF(S195<='Collection System Summary_Table'!$I$8,\"Yes\",\"NO\")","v":"Yes"}]
[null,null,null,null,null,null,null,null,null,null,null,null,0,{"$error":"#VALUE!"},{"$f":"IF(AND(Q196=0,P196=0),K196+O195,0)","v":{"$error":"#VALUE!"}},0,{"$f":"IF(AND(P196=0,N196<($B$4+$P$1)),J196,0)","v":{"$error":"#VALUE!"}},{"$f":"IF(AND(P196=0,Q196=0,O196<($B$5+$Q$1)),K196,0)","v":{"$error":"#VALUE!"}},{"$f":"S195+L196","v":0},{"$f":"IF(OR(P196>1,Q196>1,R196>1),\"YES\",\"NO\")","v":{"$error":"#VALUE!"}},{"$f":"IF(S196<='Collection System Summary_Table'!$I$8,\"Yes\",\"NO\")","v":"Yes"}]
[null,null,null,null,null,null,null,null,null,null,null,null,{"$f":"M196+I197","v":0},{"$error":"#VALUE!"},{"$error":"#VALUE!"},{"$f":"IF(M197<=$B$3,I197,0)","v":0},{"$error":"#VALUE!"},{"$error":"#VALUE!"},0,{"$error":"#VALUE!"},{"$f":"IF(S197<='Collection System Summary_Table'!$I$8,\"Yes\",\"NO\")","v":"Yes"}]
[null,null,null,null,null,null,null,null,null,null,null,null,0,{"$error":"#VALUE!"},{"$error":"#VALUE!"},0,{"$error":"#VALUE!"},{"$error":"#VALUE!"},0,{"$error":"#VALUE!"},{"$f":"IF(S198<='Collection System Summary_Table'!$I$8,\"Yes\",\"NO\")","v":"Yes"}]
[null,null,null,null,null,null,null,null,null,null,null,null,0,{"$error":"#VALUE!"},{"$error":"#VALUE!"},0,{"$error":"#VALUE!"},{"$error":"#VALUE!"},0,{"$error":"#VALUE!"},{"$f":"IF(S199<='Collection System Summary_Table'!$I$8,\"Yes\",\"NO\")","v":"Yes"}]
[null,null,null,null,null,null,null,null,null,null,null,null,0,{"$error":"#VALUE!"},{"$error":"#VALUE!"},0,{"$error":"#VALUE!"},{"$error":"#VALUE!"},0,{"$error":"#VALUE!"},{"$f":"IF(S200<='Collection System Summary_Table'!$I$8,\"Yes\",\"NO\")","v":"Yes"}]
[null,null,null,null,null,null,null,null,null,null,null,null,0,{"$error":"#VALUE!"},{"$error":"#VALUE!"},0,{"$error":"#VALUE!"},{"$error":"#VALUE!"},0,{"$error":"#VALUE!"},{"$f":"IF(S201<='Collection System Summary_Table'!$I$8,\"Yes\",\"NO\")","v":"Yes"}]
[null,null,null,null,null,null,null,null,null,null,null,null,0,{"$error":"#VALUE!"},{"$error":"#VALUE!"},0,{"$error":"#VALUE!"},{"$error":"#VALUE!"},0,{"$error":"#VALUE!"},{"$f":"IF(S202<='Collection System Summary_Table'!$I$8,\"Yes\",\"NO\")","v":"Yes"}]
[null,null,null,null,null,null,null,null,null,null,null,null,0,{"$error":"#VALUE!"},{"$error":"#VALUE!"},0,{"$error":"#VALUE!"},{"$error":"#VALUE!"},0,{"$error":"#VALUE!"},{"$f":"IF(S203<='Collection System Summary_Table'!$I$8,\"Yes\",\"NO\")","v":"Yes"}]
[null,null,null,null,null,null,null,null,null,null,null,null,0,{"$error":"#VALUE!"},{"$error":"#VALUE!"},0,{"$error":"#VALUE!"},{"$error":"#VALUE!"},0,{"$error":"#VALUE!"},{"$f":"IF(S204<='Collection System Summary_Table'!$I$8,\"Yes\",\"NO\")","v":"Yes"}]
[null,null,null,null,null,null,null,null,null,null,null,null,0,{"$error":"#VALUE!"},{"$error":"#VALUE!"},0,{"$error":"#VALUE!"},{"$error":"#VALUE!"},0,{"$error":"#VALUE!"},{"$f":"IF(S205<='Collection System Summary_Table'!$I$8,\"Yes\",\"NO\")","v":"Yes"}]
[null,null,null,null,null,null,null,null,null,null,null,null,0,{"$error":"#VALUE!"},{"$error":"#VALUE!"},0,{"$error":"#VALUE!"},{"$error":"#VALUE!"},0,{"$error":"#VALUE!"},{"$f":"IF(S206<='Collection System Summary_Table'!$I$8,\"Yes\",\"NO\")","v":"Yes"}]
[null,null,null,null,null,null,null,null,null,null,null,null,0,{"$error":"#VALUE!"},{"$error":"#VALUE!"},0,{"$error":"#VALUE!"},{"$error":"#VALUE!"},0,{"$error":"#VALUE!"},{"$f":"IF(S207<='Collection System Summary_Table'!$I$8,\"Yes\",\"NO\")","v":"Yes"}]
[null,null,null,null,null,null,null,null,null,null,null,null,0,{"$error":"#VALUE!"},{"$error":"#VALUE!"},0,{"$error":"#VALUE!"},{"$error":"#VALUE!"},0,{"$error":"#VALUE!"},{"$f":"IF(S208<='Collection System Summary_Table'!$I$8,\"Yes\",\"NO\")","v":"Yes"}]
[null,null,null,null,null,null,null,null,null,null,null,null,0,{"$error":"#VALUE!"},{"$error":"#VALUE!"},0,{"$error":"#VALUE!"},{"$error":"#VALUE!"},0,{"$error":"#VALUE!"},{"$f":"IF(S209<='Collection System Summary_Table'!$I$8,\"Yes\",\"NO\")","v":"Yes"}]
[null,null,null,null,null,null,null,null,null,null,null,null,0,{"$error":"#VALUE!"},{"$error":"#VALUE!"},0,{"$error":"#VALUE!"},{"$error":"#VALUE!"},0,{"$error":"#VALUE!"},{"$f":"IF(S210<='Collection System Summary_Table'!$I$8,\"Yes\",\"NO\")","v":"Yes"}]
[null,null,null,null,null,null,null,null,null,null,null,null,0,{"$error":"#VALUE!"},{"$error":"#VALUE!"},0,{"$error":"#VALUE!"},{"$error":"#VALUE!"},0,{"$error":"#VALUE!"},{"$f":"IF(S211<='Collection System Summary_Table'!$I$8,\"Yes\",\"NO\")","v":"Yes"}]
[null,null,null,null,null,null,null,null,null,null,null,null,0,{"$error":"#VALUE!"},{"$error":"#VALUE!"},0,{"$error":"#VALUE!"},{"$error":"#VALUE!"},0,{"$error":"#VALUE!"},{"$f":"IF(S212<='Collection System Summary_Table'!$I$8,\"Yes\",\"NO\")","v":"Yes"}]
[null,null,null,null,null,null,null,null,null,null,null,null,0,{"$error":"#VALUE!"},{"$error":"#VALUE!"},0,{"$error":"#VALUE!"},{"$error":"#VALUE!"},0,{"$error":"#VALUE!"},{"$f":"IF(S213<='Collection System Summary_Table'!$I$8,\"Yes\",\"NO\")","v":"Yes"}]
[null,null,null,null,null,null,null,null,null,null,null,null,0,{"$error":"#VALUE!"},{"$error":"#VALUE!"},0,{"$error":"#VALUE!"},{"$error":"#VALUE!"},0,{"$error":"#VALUE!"},{"$f":"IF(S214<='Collection System Summary_Table'!$I$8,\"Yes\",\"NO\")","v":"Yes"}]
[null,null,null,null,null,null,null,null,null,null,null,null,0,{"$error":"#VALUE!"},{"$error":"#VALUE!"},0,{"$error":"#VALUE!"},{"$error":"#VALUE!"},0,{"$error":"#VALUE!"},{"$f":"IF(S215<='Collection System Summary_Table'!$I$8,\"Yes\",\"NO\")","v":"Yes"}]
[null,null,null,null,null,null,null,null,null,null,null,null,0,{"$error":"#VALUE!"},{"$error":"#VALUE!"},0,{"$error":"#VALUE!"},{"$error":"#VALUE!"},0,{"$error":"#VALUE!"},{"$f":"IF(S216<='Collection System Summary_Table'!$I$8,\"Yes\",\"NO\")","v":"Yes"}]
[null,null,null,null,null,null,null,null,null,null,null,null,0,{"$error":"#VALUE!"},{"$error":"#VALUE!"},0,{"$error":"#VALUE!"},{"$error":"#VALUE!"},0,{"$error":"#VALUE!"},{"$f":"IF(S217<='Collection System Summary_Table'!$I$8,\"Yes\",\"NO\")","v":"Yes"}]
[null,null,null,null,null,null,null,null,null,null,null,null,0,{"$error":"#VALUE!"},{"$error":"#VALUE!"},0,{"$error":"#VALUE!"},{"$error":"#VALUE!"},0,{"$error":"#VALUE!"},{"$f":"IF(S218<='Collection System Summary_Table'!$I$8,\"Yes\",\"NO\")","v":"Yes"}]
[null,null,null,null,null,null,null,null,null,null,null,null,0,{"$error":"#VALUE!"},{"$error":"#VALUE!"},0,{"$error":"#VALUE!"},{"$error":"#VALUE!"},0,{"$error":"#VALUE!"},{"$f":"IF(S219<='Collection System Summary_Table'!$I$8,\"Yes\",\"NO\")","v":"Yes"}]
[null,null,null,null,null,null,null,null,null,null,null,null,0,{"$error":"#VALUE!"},{"$error":"#VALUE!"},0,{"$error":"#VALUE!"},{"$error":"#VALUE!"},0,{"$error":"#VALUE!"},{"$f":"IF(S220<='Collection System Summary_Table'!$I$8,\"Yes\",\"NO\")","v":"Yes"}]
[null,null,null,null,null,null,null,null,null,null,null,null,0,{"$error":"#VALUE!"},{"$error":"#VALUE!"},0,{"$error":"#VALUE!"},{"$error":"#VALUE!"},0,{"$error":"#VALUE!"},{"$f":"IF(S221<='Collection System Summary_Table'!$I$8,\"Yes\",\"NO\")","v":"Yes"}]
[null,null,null,null,null,null,null,null,null,null,null,null,0,{"$error":"#VALUE!"},{"$error":"#VALUE!"},0,{"$error":"#VALUE!"},{"$error":"#VALUE!"},0,{"$error":"#VALUE!"},{"$f":"IF(S222<='Collection System Summary_Table'!$I$8,\"Yes\",\"NO\")","v":"Yes"}]
[null,null,null,null,null,null,null,null,null,null,null,null,0,{"$error":"#VALUE!"},{"$error":"#VALUE!"},0,{"$error":"#VALUE!"},{"$error":"#VALUE!"},0,{"$error":"#VALUE!"},{"$f":"IF(S223<='Collection System Summary_Table'!$I$8,\"Yes\",\"NO\")","v":"Yes"}]
[null,null,null,null,null,null,null,null,null,null,null,null,0,{"$error":"#VALUE!"},{"$error":"#VALUE!"},0,{"$error":"#VALUE!"},{"$error":"#VALUE!"},0,{"$error":"#VALUE!"},{"$f":"IF(S224<='Collection System Summary_Table'!$I$8,\"Yes\",\"NO\")","v":"Yes"}]
[null,null,null,null,null,null,null,null,null,null,null,null,0,{"$error":"#VALUE!"},{"$error":"#VALUE!"},0,{"$error":"#VALUE!"},{"$error":"#VALUE!"},0,{"$error":"#VALUE!"},{"$f":"IF(S225<='Collection System Summary_Table'!$I$8,\"Yes\",\"NO\")","v":"Yes"}]
[null,null,null,null,null,null,null,null,null,null,null,null,0,{"$error":"#VALUE!"},{"$error":"#VALUE!"},0,{"$error":"#VALUE!"},{"$error":"#VALUE!"},0,{"$error":"#VALUE!"},{"$f":"IF(S226<='Collection System Summary_Table'!$I$8,\"Yes\",\"NO\")","v":"Yes"}]
[null,null,null,null,null,null,null,null,null,null,null,null,0,{"$error":"#VALUE!"},{"$error":"#VALUE!"},0,{"$error":"#VALUE!"},{"$error":"#VALUE!"},0,{"$error":"#VALUE!"},{"$f":"IF(S227<='Collection System Summary_Table'!$I$8,\"Yes\",\"NO\")","v":"Yes"}]
[null,null,null,null,null,null,null,null,null,null,null,null,0,{"$error":"#VALUE!"},{"$error":"#VALUE!"},0,{"$error":"#VALUE!"},{"$error":"#VALUE!"},0,{"$error":"#VALUE!"},{"$f":"IF(S228<='Collection System Summary_Table'!$I$8,\"Yes\",\"NO\")","v":"Yes"}]
[null,null,null,null,null,null,null,null,null,null,null,null,0,{"$error":"#VALUE!"},{"$error":"#VALUE!"},0,{"$error":"#VALUE!"},{"$error":"#VALUE!"},0,{"$error":"#VALUE!"},{"$f":"IF(S229<='Collection System Summary_Table'!$I$8,\"Yes\",\"NO\")","v":"Yes"}]
[null,null,null,null,null,null,null,null,null,null,null,null,0,{"$error":"#VALUE!"},{"$error":"#VALUE!"},0,{"$error":"#VALUE!"},{"$error":"#VALUE!"},0,{"$error":"#VALUE!"},{"$f":"IF(S230<='Collection System Summary_Table'!$I$8,\"Yes\",\"NO\")","v":"Yes"}]
[null,null,null,null,null,null,null,null,null,null,null,null,0,{"$error":"#VALUE!"},{"$error":"#VALUE!"},0,{"$error":"#VALUE!"},{"$error":"#VALUE!"},0,{"$error":"#VALUE!"},{"$f":"IF(S231<='Collection System Summary_Table'!$I$8,\"Yes\",\"NO\")","v":"Yes"}]
[null,null,null,null,null,null,null,null,null,null,null,null,0,{"$error":"#VALUE!"},{"$error":"#VALUE!"},0,{"$error":"#VALUE!"},{"$error":"#VALUE!"},0,{"$error":"#VALUE!"},{"$f":"IF(S232<='Collection System Summary_Table'!$I$8,\"Yes\",\"NO\")","v":"Yes"}]
[null,null,null,null,null,null,null,null,null,null,null,null,0,{"$error":"#VALUE!"},{"$error":"#VALUE!"},0,{"$error":"#VALUE!"},{"$error":"#VALUE!"},0,{"$error":"#VALUE!"},{"$f":"IF(S233<='Collection System Summary_Table'!$I$8,\"Yes\",\"NO\")","v":"Yes"}]
[null,null,null,null,null,null,null,null,null,null,null,null,0,{"$error":"#VALUE!"},{"$error":"#VALUE!"},0,{"$error":"#VALUE!"},{"$error":"#VALUE!"},0,{"$error":"#VALUE!"},{"$f":"IF(S234<='Collection System Summary_Table'!$I$8,\"Yes\",\"NO\")","v":"Yes"}]
[null,null,null,null,null,null,null,null,null,null,null,null,0,{"$error":"#VALUE!"},{"$error":"#VALUE!"},0,{"$error":"#VALUE!"},{"$error":"#VALUE!"},0,{"$error":"#VALUE!"},{"$f":"IF(S235<='Collection System Summary_Table'!$I$8,\"Yes\",\"NO\")","v":"Yes"}]
[null,null,null,null,null,null,null,null,null,null,null,null,0,{"$error":"#VALUE!"},{"$error":"#VALUE!"},0,{"$error":"#VALUE!"},{"$error":"#VALUE!"},0,{"$error":"#VALUE!"},{"$f":"IF(S236<='Collection System Summary_Table'!$I$8,\"Yes\",\"NO\")","v":"Yes"}]
[null,null,null,null,null,null,null,null,null,null,null,null,0,{"$error":"#VALUE!"},{"$error":"#VALUE!"},0,{"$error":"#VALUE!"},{"$error":"#VALUE!"},0,{"$error":"#VALUE!"},{"$f":"IF(S237<='Collection System Summary_Table'!$I$8,\"Yes\",\"NO\")","v":"Yes"}]
[null,null,null,null,null,null,null,null,null,null,null,null,0,{"$error":"#VALUE!"},{"$error":"#VALUE!"},0,{"$error":"#VALUE!"},{"$error":"#VALUE!"},0,{"$error":"#VALUE!"},{"$f":"IF(S238<='Collection System Summary_Table'!$I$8,\"Yes\",\"NO\")","v":"Yes"}]
[null,null,null,null,null,null,null,null,null,null,null,null,0,{"$error":"#VALUE!"},{"$error":"#VALUE!"},0,{"$error":"#VALUE!"},{"$error":"#VALUE!"},0,{"$error":"#VALUE!"},{"$f":"IF(S239<='Collection System Summary_Table'!$I$8,\"Yes\",\"NO\")","v":"Yes"}]
[null,null,null,null,null,null,null,null,null,null,null,null,0,{"$error":"#VALUE!"},{"$error":"#VALUE!"},0,{"$error":"#VALUE!"},{"$error":"#VALUE!"},0,{"$error":"#VALUE!"},{"$f":"IF(S240<='Collection System Summary_Table'!$I$8,\"Yes\",\"NO\")","v":"Yes"}]
[null,null,null,null,null,null,null,null,null,null,null,null,0,{"$error":"#VALUE!"},{"$error":"#VALUE!"},0,{"$error":"#VALUE!"},{"$error":"#VALUE!"},0,{"$error":"#VALUE!"},{"$f":"IF(S241<='Collection System Summary_Table'!$I$8,\"Yes\",\"NO\")","v":"Yes"}]
[null,null,null,null,null,null,null,null,null,null,null,null,0,{"$error":"#VALUE!"},{"$error":"#VALUE!"},0,{"$error":"#VALUE!"},{"$error":"#VALUE!"},0,{"$error":"#VALUE!"},{"$f":"IF(S242<='Collection System Summary_Table'!$I$8,\"Yes\",\"NO\")","v":"Yes"}]
[null,null,null,null,null,null,null,null,null,null,null,null,0,{"$error":"#VALUE!"},{"$error":"#VALUE!"},0,{"$error":"#VALUE!"},{"$error":"#VALUE!"},0,{"$error":"#VALUE!"},{"$f":"IF(S243<='Collection System Summary_Table'!$I$8,\"Yes\",\"NO\")","v":"Yes"}]
[null,null,null,null,null,null,null,null,null,null,null,null,0,{"$error":"#VALUE!"},{"$error":"#VALUE!"},0,{"$error":"#VALUE!"},{"$error":"#VALUE!"},0,{"$error":"#VALUE!"},{"$f":"IF(S244<='Collection System Summary_Table'!$I$8,\"Yes\",\"NO\")","v":"Yes"}]
[null,null,null,null,null,null,null,null,null,null,null,null,0,{"$error":"#VALUE!"},{"$error":"#VALUE!"},0,{"$error":"#VALUE!"},{"$error":"#VALUE!"},0,{"$error":"#VALUE!"},{"$f":"IF(S245<='Collection System Summary_Table'!$I$8,\"Yes\",\"NO\")","v":"Yes"}]
[null,null,null,null,null,null,null,null,null,null,null,null,0,{"$error":"#VALUE!"},{"$error":"#VALUE!"},0,{"$error":"#VALUE!"},{"$error":"#VALUE!"},0,{"$error":"#VALUE!"},{"$f":"IF(S246<='Collection System Summary_Table'!$I$8,\"Yes\",\"NO\")","v":"Yes"}]
[null,null,null,null,null,null,null,null,null,null,null,null,0,{"$error":"#VALUE!"},{"$error":"#VALUE!"},0,{"$error":"#VALUE!"},{"$error":"#VALUE!"},0,{"$error":"#VALUE!"},{"$f":"IF(S247<='Collection System Summary_Table'!$I$8,\"Yes\",\"NO\")","v":"Yes"}]
[null,null,null,null,null,null,null,null,null,null,null,null,0,{"$error":"#VALUE!"},{"$error":"#VALUE!"},0,{"$error":"#VALUE!"},{"$error":"#VALUE!"},0,{"$error":"#VALUE!"},{"$f":"IF(S248<='Collection System Summary_Table'!$I$8,\"Yes\",\"NO\")","v":"Yes"}]
[null,null,null,null,null,null,null,null,null,null,null,null,0,{"$error":"#VALUE!"},{"$error":"#VALUE!"},0,{"$error":"#VALUE!"},{"$error":"#VALUE!"},0,{"$error":"#VALUE!"},{"$f":"IF(S249<='Collection System Summary_Table'!$I$8,\"Yes\",\"NO\")","v":"Yes"}]
[null,null,null,null,null,null,null,null,null,null,null,null,0,{"$error":"#VALUE!"},{"$error":"#VALUE!"},0,{"$error":"#VALUE!"},{"$error":"#VALUE!"},0,{"$error":"#VALUE!"},{"$f":"IF(S250<='Collection System Summary_Table'!$I$8,\"Yes\",\"NO\")","v":"Yes"}]
[null,null,null,null,null,null,null,null,null,null,null,null,0,{"$error":"#VALUE!"},{"$error":"#VALUE!"},0,{"$error":"#VALUE!"},{"$error":"#VALUE!"},0,{"$error":"#VALUE!"},{"$f":"IF(S251<='Collection System Summary_Table'!$I$8,\"Yes\",\"NO\")","v":"Yes"}]
[null,null,null,null,null,null,null,null,null,null,null,null,0,{"$error":"#VALUE!"},{"$error":"#VALUE!"},0,{"$error":"#VALUE!"},{"$error":"#VALUE!"},0,{"$error":"#VALUE!"},{"$f":"IF(S252<='Collection System Summary_Table'!$I$8,\"Yes\",\"NO\")","v":"Yes"}]
[null,null,null,null,null,null,null,null,null,null,null,null,0,{"$error":"#VALUE!"},{"$error":"#VALUE!"},0,{"$error":"#VALUE!"},{"$error":"#VALUE!"},0,{"$error":"#VALUE!"},{"$f":"IF(S253<='Collection System Summary_Table'!$I$8,\"Yes\",\"NO\")","v":"Yes"}]
[null,null,null,null,null,null,null,null,null,null,null,null,0,{"$error":"#VALUE!"},{"$error":"#VALUE!"},0,{"$error":"#VALUE!"},{"$error":"#VALUE!"},0,{"$error":"#VALUE!"},{"$f":"IF(S254<='Collection System Summary_Table'!$I$8,\"Yes\",\"NO\")","v":"Yes"}]
[null,null,null,null,null,null,null,null,null,null,null,null,0,{"$error":"#VALUE!"},{"$error":"#VALUE!"},0,{"$error":"#VALUE!"},{"$error":"#VALUE!"},0,{"$error":"#VALUE!"},{"$f":"IF(S255<='Collection System Summary_Table'!$I$8,\"Yes\",\"NO\")","v":"Yes"}]
[null,null,null,null,null,null,null,null,null,null,null,null,0,{"$error":"#VALUE!"},{"$error":"#VALUE!"},0,{"$error":"#VALUE!"},{"$error":"#VALUE!"},0,{"$error":"#VALUE!"},{"$f":"IF(S256<='Collection System Summary_Table'!$I$8,\"Yes\",\"NO\")","v":"Yes"}]
[null,null,null,null,null,null,null,null,null,null,null,null,0,{"$error":"#VALUE!"},{"$error":"#VALUE!"},0,{"$error":"#VALUE!"},{"$error":"#VALUE!"},0,{"$error":"#VALUE!"},{"$f":"IF(S257<='Collection System Summary_Table'!$I$8,\"Yes\",\"NO\")","v":"Yes"}]
[null,null,null,null,null,null,null,null,null,null,null,null,0,{"$error":"#VALUE!"},{"$error":"#VALUE!"},0,{"$error":"#VALUE!"},{"$error":"#VALUE!"},0,{"$error":"#VALUE!"},{"$f":"IF(S258<='Collection System Summary_Table'!$I$8,\"Yes\",\"NO\")","v":"Yes"}]
[null,null,null,null,null,null,null,null,null,null,null,null,0,{"$f":"IF(P259=0,I259+N258,0)","v":{"$error":"#VALUE!"}},{"$error":"#VALUE!"},0,{"$error":"#VALUE!"},{"$error":"#VALUE!"},0,{"$error":"#VALUE!"},{"$f":"IF(S259<='Collection System Summary_Table'!$I$8,\"Yes\",\"NO\")","v":"Yes"}]
[null,null,null,null,null,null,null,null,null,null,null,null,0,{"$error":"#VALUE!"},{"$f":"IF(AND(Q260=0,P260=0),K260+O259,0)","v":{"$error":"#VALUE!"}},0,{"$f":"IF(AND(P260=0,N260<($B$4+$P$1)),J260,0)","v":{"$error":"#VALUE!"}},{"$f":"IF(AND(P260=0,Q260=0,O260<($B$5+$Q$1)),K260,0)","v":{"$error":"#VALUE!"}},{"$f":"S259+L260","v":0},{"$f":"IF(OR(P260>1,Q260>1,R260>1),\"YES\",\"NO\")","v":{"$error":"#VALUE!"}},{"$f":"IF(S260<='Collection System Summary_Table'!$I$8,\"Yes\",\"NO\")","v":"Yes"}]
[null,null,null,null,null,null,null,null,null,null,null,null,{"$f":"M260+I261","v":0},{"$error":"#VALUE!"},{"$error":"#VALUE!"},{"$f":"IF(M261<=$B$3,I261,0)","v":0},{"$error":"#VALUE!"},{"$error":"#VALUE!"},0,{"$error":"#VALUE!"},{"$f":"IF(S261<='Collection System Summary_Table'!$I$8,\"Yes\",\"NO\")","v":"Yes"}]
[null,null,null,null,null,null,null,null,null,null,null,null,0,{"$error":"#VALUE!"},{"$error":"#VALUE!"},0,{"$error":"#VALUE!"},{"$error":"#VALUE!"},0,{"$error":"#VALUE!"},{"$f":"IF(S262<='Collection System Summary_Table'!$I$8,\"Yes\",\"NO\")","v":"Yes"}]
[null,null,null,null,null,null,null,null,null,null,null,null,0,{"$error":"#VALUE!"},{"$error":"#VALUE!"},0,{"$error":"#VALUE!"},{"$error":"#VALUE!"},0,{"$error":"#VALUE!"},{"$f":"IF(S263<='Collection System Summary_Table'!$I$8,\"Yes\",\"NO\")","v":"Yes"}]
[null,null,null,null,null,null,null,null,null,null,null,null,0,{"$error":"#VALUE!"},{"$error":"#VALUE!"},0,{"$error":"#VALUE!"},{"$error":"#VALUE!"},0,{"$error":"#VALUE!"},{"$f":"IF(S264<='Collection System Summary_Table'!$I$8,\"Yes\",\"NO\")","v":"Yes"}]
[null,null,null,null,null,null,null,null,null,null,null,null,0,{"$error":"#VALUE!"},{"$error":"#VALUE!"},0,{"$error":"#VALUE!"},{"$error":"#VALUE!"},0,{"$error":"#VALUE!"},{"$f":"IF(S265<='Collection System Summary_Table'!$I$8,\"Yes\",\"NO\")","v":"Yes"}]
[null,null,null,null,null,null,null,null,null,null,null,null,0,{"$error":"#VALUE!"},{"$error":"#VALUE!"},0,{"$error":"#VALUE!"},{"$error":"#VALUE!"},0,{"$error":"#VALUE!"},{"$f":"IF(S266<='Collection System Summary_Table'!$I$8,\"Yes\",\"NO\")","v":"Yes"}]
[null,null,null,null,null,null,null,null,null,null,null,null,0,{"$error":"#VALUE!"},{"$error":"#VALUE!"},0,{"$error":"#VALUE!"},{"$error":"#VALUE!"},0,{"$error":"#VALUE!"},{"$f":"IF(S267<='Collection System Summary_Table'!$I$8,\"Yes\",\"NO\")","v":"Yes"}]
[null,null,null,null,null,null,null,null,null,null,null,null,0,{"$error":"#VALUE!"},{"$error":"#VALUE!"},0,{"$error":"#VALUE!"},{"$error":"#VALUE!"},0,{"$error":"#VALUE!"},{"$f":"IF(S268<='Collection System Summary_Table'!$I$8,\"Yes\",\"NO\")","v":"Yes"}]
[null,null,null,null,null,null,null,null,null,null,null,null,0,{"$error":"#VALUE!"},{"$error":"#VALUE!"},0,{"$error":"#VALUE!"},{"$error":"#VALUE!"},0,{"$error":"#VALUE!"},{"$f":"IF(S269<='Collection System Summary_Table'!$I$8,\"Yes\",\"NO\")","v":"Yes"}]
[null,null,null,null,null,null,null,null,null,null,null,null,0,{"$error":"#VALUE!"},{"$error":"#VALUE!"},0,{"$error":"#VALUE!"},{"$error":"#VALUE!"},0,{"$error":"#VALUE!"},{"$f":"IF(S270<='Collection System Summary_Table'!$I$8,\"Yes\",\"NO\")","v":"Yes"}]
[null,null,null,null,null,null,null,null,null,null,null,null,0,{"$error":"#VALUE!"},{"$error":"#VALUE!"},0,{"$error":"#VALUE!"},{"$error":"#VALUE!"},0,{"$error":"#VALUE!"},{"$f":"IF(S271<='Collection System Summary_Table'!$I$8,\"Yes\",\"NO\")","v":"Yes"}]
[null,null,null,null,null,null,null,null,null,null,null,null,0,{"$error":"#VALUE!"},{"$error":"#VALUE!"},0,{"$error":"#VALUE!"},{"$error":"#VALUE!"},0,{"$error":"#VALUE!"},{"$f":"IF(S272<='Collection System Summary_Table'!$I$8,\"Yes\",\"NO\")","v":"Yes"}]
[null,null,null,null,null,null,null,null,null,null,null,null,0,{"$error":"#VALUE!"},{"$error":"#VALUE!"},0,{"$error":"#VALUE!"},{"$error":"#VALUE!"},0,{"$error":"#VALUE!"},{"$f":"IF(S273<='Collection System Summary_Table'!$I$8,\"Yes\",\"NO\")","v":"Yes"}]
[null,null,null,null,null,null,null,null,null,null,null,null,0,{"$error":"#VALUE!"},{"$error":"#VALUE!"},0,{"$error":"#VALUE!"},{"$error":"#VALUE!"},0,{"$error":"#VALUE!"},{"$f":"IF(S274<='Collection System Summary_Table'!$I$8,\"Yes\",\"NO\")","v":"Yes"}]
[null,null,null,null,null,null,null,null,null,null,null,null,0,{"$error":"#VALUE!"},{"$error":"#VALUE!"},0,{"$error":"#VALUE!"},{"$error":"#VALUE!"},0,{"$error":"#VALUE!"},{"$f":"IF(S275<='Collection System Summary_Table'!$I$8,\"Yes\",\"NO\")","v":"Yes"}]
[null,null,null,null,null,null,null,null,null,null,null,null,0,{"$error":"#VALUE!"},{"$error":"#VALUE!"},0,{"$error":"#VALUE!"},{"$error":"#VALUE!"},0,{"$error":"#VALUE!"},{"$f":"IF(S276<='Collection System Summary_Table'!$I$8,\"Yes\",\"NO\")","v":"Yes"}]
[null,null,null,null,null,null,null,null,null,null,null,null,0,{"$error":"#VALUE!"},{"$error":"#VALUE!"},0,{"$error":"#VALUE!"},{"$error":"#VALUE!"},0,{"$error":"#VALUE!"},{"$f":"IF(S277<='Collection System Summary_Table'!$I$8,\"Yes\",\"NO\")","v":"Yes"}]
[null,null,null,null,null,null,null,null,null,null,null,null,0,{"$error":"#VALUE!"},{"$error":"#VALUE!"},0,{"$error":"#VALUE!"},{"$error":"#VALUE!"},0,{"$error":"#VALUE!"},{"$f":"IF(S278<='Collection System Summary_Table'!$I$8,\"Yes\",\"NO\")","v":"Yes"}]
[null,null,null,null,null,null,null,null,null,null,null,null,0,{"$error":"#VALUE!"},{"$error":"#VALUE!"},0,{"$error":"#VALUE!"},{"$error":"#VALUE!"},0,{"$error":"#VALUE!"},{"$f":"IF(S279<='Collection System Summary_Table'!$I$8,\"Yes\",\"NO\")","v":"Yes"}]
[null,null,null,null,null,null,null,null,null,null,null,null,0,{"$error":"#VALUE!"},{"$error":"#VALUE!"},0,{"$error":"#VALUE!"},{"$error":"#VALUE!"},0,{"$error":"#VALUE!"},{"$f":"IF(S280<='Collection System Summary_Table'!$I$8,\"Yes\",\"NO\")","v":"Yes"}]
[null,null,null,null,null,null,null,null,null,null,null,null,0,{"$error":"#VALUE!"},{"$error":"#VALUE!"},0,{"$error":"#VALUE!"},{"$error":"#VALUE!"},0,{"$error":"#VALUE!"},{"$f":"IF(S281<='Collection System Summary_Table'!$I$8,\"Yes\",\"NO\")","v":"Yes"}]
[null,null,null,null,null,null,null,null,null,null,null,null,0,{"$error":"#VALUE!"},{"$error":"#VALUE!"},0,{"$error":"#VALUE!"},{"$error":"#VALUE!"},0,{"$error":"#VALUE!"},{"$f":"IF(S282<='Collection System Summary_Table'!$I$8,\"Yes\",\"NO\")","v":"Yes"}]
[null,null,null,null,null,null,null,null,null,null,null,null,0,{"$error":"#VALUE!"},{"$error":"#VALUE!"},0,{"$error":"#VALUE!"},{"$error":"#VALUE!"},0,{"$error":"#VALUE!"},{"$f":"IF(S283<='Collection System Summary_Table'!$I$8,\"Yes\",\"NO\")","v":"Yes"}]
[null,null,null,null,null,null,null,null,null,null,null,null,0,{"$error":"#VALUE!"},{"$error":"#VALUE!"},0,{"$error":"#VALUE!"},{"$error":"#VALUE!"},0,{"$error":"#VALUE!"},{"$f":"IF(S284<='Collection System Summary_Table'!$I$8,\"Yes\",\"NO\")","v":"Yes"}]
[null,null,null,null,null,null,null,null,null,null,null,null,0,{"$error":"#VALUE!"},{"$error":"#VALUE!"},0,{"$error":"#VALUE!"},{"$error":"#VALUE!"},0,{"$error":"#VALUE!"},{"$f":"IF(S285<='Collection System Summary_Table'!$I$8,\"Yes\",\"NO\")","v":"Yes"}]
[null,null,null,null,null,null,null,null,null,null,null,null,0,{"$error":"#VALUE!"},{"$error":"#VALUE!"},0,{"$error":"#VALUE!"},{"$error":"#VALUE!"},0,{"$error":"#VALUE!"},{"$f":"IF(S286<='Collection System Summary_Table'!$I$8,\"Yes\",\"NO\")","v":"Yes"}]
[null,null,null,null,null,null,null,null,null,null,null,null,0,{"$error":"#VALUE!"},{"$error":"#VALUE!"},0,{"$error":"#VALUE!"},{"$error":"#VALUE!"},0,{"$error":"#VALUE!"},{"$f":"IF(S287<='Collection System Summary_Table'!$I$8,\"Yes\",\"NO\")","v":"Yes"}]
[null,null,null,null,null,null,null,null,null,null,null,null,0,{"$error":"#VALUE!"},{"$error":"#VALUE!"},0,{"$error":"#VALUE!"},{"$error":"#VALUE!"},0,{"$error":"#VALUE!"},{"$f":"IF(S288<='Collection System Summary_Table'!$I$8,\"Yes\",\"NO\")","v":"Yes"}]
[null,null,null,null,null,null,null,null,null,null,null,null,0,{"$error":"#VALUE!"},{"$error":"#VALUE!"},0,{"$error":"#VALUE!"},{"$error":"#VALUE!"},0,{"$error":"#VALUE!"},{"$f":"IF(S289<='Collection System Summary_Table'!$I$8,\"Yes\",\"NO\")","v":"Yes"}]
[null,null,null,null,null,null,null,null,null,null,null,null,0,{"$error":"#VALUE!"},{"$error":"#VALUE!"},0,{"$error":"#VALUE!"},{"$error":"#VALUE!"},0,{"$error":"#VALUE!"},{"$f":"IF(S290<='Collection System Summary_Table'!$I$8,\"Yes\",\"NO\")","v":"Yes"}]
[null,null,null,null,null,null,null,null,null,null,null,null,0,{"$error":"#VALUE!"},{"$error":"#VALUE!"},0,{"$error":"#VALUE!"},{"$error":"#VALUE!"},0,{"$error":"#VALUE!"},{"$f":"IF(S291<='Collection System Summary_Table'!$I$8,\"Yes\",\"NO\")","v":"Yes"}]
[null,null,null,null,null,null,null,null,null,null,null,null,0,{"$error":"#VALUE!"},{"$error":"#VALUE!"},0,{"$error":"#VALUE!"},{"$error":"#VALUE!"},0,{"$error":"#VALUE!"},{"$f":"IF(S292<='Collection System Summary_Table'!$I$8,\"Yes\",\"NO\")","v":"Yes"}]
[null,null,null,null,null,null,null,null,null,null,null,null,0,{"$error":"#VALUE!"},{"$error":"#VALUE!"},0,{"$error":"#VALUE!"},{"$error":"#VALUE!"},0,{"$error":"#VALUE!"},{"$f":"IF(S293<='Collection System Summary_Table'!$I$8,\"Yes\",\"NO\")","v":"Yes"}]
[null,null,null,null,null,null,null,null,null,null,null,null,0,{"$error":"#VALUE!"},{"$error":"#VALUE!"},0,{"$error":"#VALUE!"},{"$error":"#VALUE!"},0,{"$error":"#VALUE!"},{"$f":"IF(S294<='Collection System Summary_Table'!$I$8,\"Yes\",\"NO\")","v":"Yes"}]
[null,null,null,null,null,null,null,null,null,null,null,null,0,{"$error":"#VALUE!"},{"$error":"#VALUE!"},0,{"$error":"#VALUE!"},{"$error":"#VALUE!"},0,{"$error":"#VALUE!"},{"$f":"IF(S295<='Collection System Summary_Table'!$I$8,\"Yes\",\"NO\")","v":"Yes"}]
[null,null,null,null,null,null,null,null,null,null,null,null,0,{"$error":"#VALUE!"},{"$error":"#VALUE!"},0,{"$error":"#VALUE!"},{"$error":"#VALUE!"},0,{"$error":"#VALUE!"},{"$f":"IF(S296<='Collection System Summary_Table'!$I$8,\"Yes\",\"NO\")","v":"Yes"}]
[null,null,null,null,null,null,null,null,null,null,null,null,0,{"$error":"#VALUE!"},{"$error":"#VALUE!"},0,{"$error":"#VALUE!"},{"$error":"#VALUE!"},0,{"$error":"#VALUE!"},{"$f":"IF(S297<='Collection System Summary_Table'!$I$8,\"Yes\",\"NO\")","v":"Yes"}]
[null,null,null,null,null,null,null,null,null,null,null,null,0,{"$error":"#VALUE!"},{"$error":"#VALUE!"},0,{"$error":"#VALUE!"},{"$error":"#VALUE!"},0,{"$error":"#VALUE!"},{"$f":"IF(S298<='Collection System Summary_Table'!$I$8,\"Yes\",\"NO\")","v":"Yes"}]
[null,null,null,null,null,null,null,null,null,null,null,null,0,{"$error":"#VALUE!"},{"$error":"#VALUE!"},0,{"$error":"#VALUE!"},{"$error":"#VALUE!"},0,{"$error":"#VALUE!"},{"$f":"IF(S299<='Collection System Summary_Table'!$I$8,\"Yes\",\"NO\")","v":"Yes"}]
[null,null,null,null,null,null,null,null,null,null,null,null,0,{"$error":"#VALUE!"},{"$error":"#VALUE!"},0,{"$error":"#VALUE!"},{"$error":"#VALUE!"},0,{"$error":"#VALUE!"},{"$f":"IF(S300<='Collection System Summary_Table'!$I$8,\"Yes\",\"NO\")","v":"Yes"}]
[null,null,null,null,null,null,null,null,null,null,null,null,0,{"$error":"#VALUE!"},{"$error":"#VALUE!"},0,{"$error":"#VALUE!"},{"$error":"#VALUE!"},0,{"$error":"#VALUE!"},{"$f":"IF(S301<='Collection System Summary_Table'!$I$8,\"Yes\",\"NO\")","v":"Yes"}]
[null,null,null,null,null,null,null,null,null,null,null,null,0,{"$error":"#VALUE!"},{"$error":"#VALUE!"},0,{"$error":"#VALUE!"},{"$error":"#VALUE!"},0,{"$error":"#VALUE!"},{"$f":"IF(S302<='Collection System Summary_Table'!$I$8,\"Yes\",\"NO\")","v":"Yes"}]
[null,null,null,null,null,null,null,null,null,null,null,null,0,{"$error":"#VALUE!"},{"$error":"#VALUE!"},0,{"$error":"#VALUE!"},{"$error":"#VALUE!"},0,{"$error":"#VALUE!"},{"$f":"IF(S303<='Collection System Summary_Table'!$I$8,\"Yes\",\"NO\")","v":"Yes"}]
[null,null,null,null,null,null,null,null,null,null,null,null,0,{"$error":"#VALUE!"},{"$error":"#VALUE!"},0,{"$error":"#VALUE!"},{"$error":"#VALUE!"},0,{"$error":"#VALUE!"},{"$f":"IF(S304<='Collection System Summary_Table'!$I$8,\"Yes\",\"NO\")","v":"Yes"}]
[null,null,null,null,null,null,null,null,null,null,null,null,0,{"$error":"#VALUE!"},{"$error":"#VALUE!"},0,{"$error":"#VALUE!"},{"$error":"#VALUE!"},0,{"$error":"#VALUE!"},{"$f":"IF(S305<='Collection System Summary_Table'!$I$8,\"Yes\",\"NO\")","v":"Yes"}]
[null,null,null,null,null,null,null,null,null,null,null,null,0,{"$error":"#VALUE!"},{"$error":"#VALUE!"},0,{"$error":"#VALUE!"},{"$error":"#VALUE!"},0,{"$error":"#VALUE!"},{"$f":"IF(S306<='Collection System Summary_Table'!$I$8,\"Yes\",\"NO\")","v":"Yes"}]
[null,null,null,null,null,null,null,null,null,null,null,null,0,{"$error":"#VALUE!"},{"$error":"#VALUE!"},0,{"$error":"#VALUE!"},{"$error":"#VALUE!"},0,{"$error":"#VALUE!"},{"$f":"IF(S307<='Collection System Summary_Table'!$I$8,\"Yes\",\"NO\")","v":"Yes"}]
[null,null,null,null,null,null,null,null,null,null,null,null,0,{"$error":"#VALUE!"},{"$error":"#VALUE!"},0,{"$error":"#VALUE!"},{"$error":"#VALUE!"},0,{"$error":"#VALUE!"},{"$f":"IF(S308<='Collection System Summary_Table'!$I$8,\"Yes\",\"NO\")","v":"Yes"}]
[null,null,null,null,null,null,null,null,null,null,null,null,0,{"$error":"#VALUE!"},{"$error":"#VALUE!"},0,{"$error":"#VALUE!"},{"$error":"#VALUE!"},0,{"$error":"#VALUE!"},{"$f":"IF(S309<='Collection System Summary_Table'!$I$8,\"Yes\",\"NO\")","v":"Yes"}]
[null,null,null,null,null,null,null,null,null,null,null,null,0,{"$error":"#VALUE!"},{"$error":"#VALUE!"},0,{"$error":"#VALUE!"},{"$error":"#VALUE!"},0,{"$error":"#VALUE!"},{"$f":"IF(S310<='Collection System Summary_Table'!$I$8,\"Yes\",\"NO\")","v":"Yes"}]
[null,null,null,null,null,null,null,null,null,null,null,null,0,{"$error":"#VALUE!"},{"$error":"#VALUE!"},0,{"$error":"#VALUE!"},{"$error":"#VALUE!"},0,{"$error":"#VALUE!"},{"$f":"IF(S311<='Collection System Summary_Table'!$I$8,\"Yes\",\"NO\")","v":"Yes"}]
[null,null,null,null,null,null,null,null,null,null,null,null,0,{"$error":"#VALUE!"},{"$error":"#VALUE!"},0,{"$error":"#VALUE!"},{"$error":"#VALUE!"},0,{"$error":"#VALUE!"},{"$f":"IF(S312<='Collection System Summary_Table'!$I$8,\"Yes\",\"NO\")","v":"Yes"}]
[null,null,null,null,null,null,null,null,null,null,null,null,0,{"$error":"#VALUE!"},{"$error":"#VALUE!"},0,{"$error":"#VALUE!"},{"$error":"#VALUE!"},0,{"$error":"#VALUE!"},{"$f":"IF(S313<='Collection System Summary_Table'!$I$8,\"Yes\",\"NO\")","v":"Yes"}]
[null,null,null,null,null,null,null,null,null,null,null,null,0,{"$error":"#VALUE!"},{"$error":"#VALUE!"},0,{"$error":"#VALUE!"},{"$error":"#VALUE!"},0,{"$error":"#VALUE!"},{"$f":"IF(S314<='Collection System Summary_Table'!$I$8,\"Yes\",\"NO\")","v":"Yes"}]
[null,null,null,null,null,null,null,null,null,null,null,null,0,{"$error":"#VALUE!"},{"$error":"#VALUE!"},0,{"$error":"#VALUE!"},{"$error":"#VALUE!"},0,{"$error":"#VALUE!"},{"$f":"IF(S315<='Collection System Summary_Table'!$I$8,\"Yes\",\"NO\")","v":"Yes"}]
[null,null,null,null,null,null,null,null,null,null,null,null,0,{"$error":"#VALUE!"},{"$error":"#VALUE!"},0,{"$error":"#VALUE!"},{"$error":"#VALUE!"},0,{"$error":"#VALUE!"},{"$f":"IF(S316<='Collection System Summary_Table'!$I$8,\"Yes\",\"NO\")","v":"Yes"}]
[null,null,null,null,null,null,null,null,null,null,null,null,0,{"$error":"#VALUE!"},{"$error":"#VALUE!"},0,{"$error":"#VALUE!"},{"$error":"#VALUE!"},0,{"$error":"#VALUE!"},{"$f":"IF(S317<='Collection System Summary_Table'!$I$8,\"Yes\",\"NO\")","v":"Yes"}]
[null,null,null,null,null,null,null,null,null,null,null,null,0,{"$error":"#VALUE!"},{"$error":"#VALUE!"},0,{"$error":"#VALUE!"},{"$error":"#VALUE!"},0,{"$error":"#VALUE!"},{"$f":"IF(S318<='Collection System Summary_Table'!$I$8,\"Yes\",\"NO\")","v":"Yes"}]
[null,null,null,null,null,null,null,null,null,null,null,null,0,{"$error":"#VALUE!"},{"$error":"#VALUE!"},0,{"$error":"#VALUE!"},{"$error":"#VALUE!"},0,{"$error":"#VALUE!"},{"$f":"IF(S319<='Collection System Summary_Table'!$I$8,\"Yes\",\"NO\")","v":"Yes"}]
[null,null,null,null,null,null,null,null,null,null,null,null,0,{"$error":"#VALUE!"},{"$error":"#VALUE!"},0,{"$error":"#VALUE!"},{"$error":"#VALUE!"},0,{"$error":"#VALUE!"},{"$f":"IF(S320<='Collection System Summary_Table'!$I$8,\"Yes\",\"NO\")","v":"Yes"}]
[null,null,null,null,null,null,null,null,null,null,null,null,0,{"$error":"#VALUE!"},{"$error":"#VALUE!"},0,{"$error":"#VALUE!"},{"$error":"#VALUE!"},0,{"$error":"#VALUE!"},{"$f":"IF(S321<='Collection System Summary_Table'!$I$8,\"Yes\",\"NO\")","v":"Yes"}]
[null,null,null,null,null,null,null,null,null,null,null,null,0,{"$error":"#VALUE!"},{"$error":"#VALUE!"},0,{"$error":"#VALUE!"},{"$error":"#VALUE!"},0,{"$error":"#VALUE!"},{"$f":"IF(S322<='Collection System Summary_Table'!$I$8,\"Yes\",\"NO\")","v":"Yes"}]
[null,null,null,null,null,null,null,null,null,null,null,null,0,{"$f":"IF(P323=0,I323+N322,0)","v":{"$error":"#VALUE!"}},{"$error":"#VALUE!"},0,{"$error":"#VALUE!"},{"$error":"#VALUE!"},0,{"$error":"#VALUE!"},{"$f":"IF(S323<='Collection System Summary_Table'!$I$8,\"Yes\",\"NO\")","v":"Yes"}]
[null,null,null,null,null,null,null,null,null,null,null,null,0,{"$error":"#VALUE!"},{"$f":"IF(AND(Q324=0,P324=0),K324+O323,0)","v":{"$error":"#VALUE!"}},0,{"$f":"IF(AND(P324=0,N324<($B$4+$P$1)),J324,0)","v":{"$error":"#VALUE!"}},{"$f":"IF(AND(P324=0,Q324=0,O324<($B$5+$Q$1)),K324,0)","v":{"$error":"#VALUE!"}},{"$f":"S323+L324","v":0},{"$f":"IF(OR(P324>1,Q324>1,R324>1),\"YES\",\"NO\")","v":{"$error":"#VALUE!"}},{"$f":"IF(S324<='Collection System Summary_Table'!$I$8,\"Yes\",\"NO\")","v":"Yes"}]
[null,null,null,null,null,null,null,null,null,null,null,null,{"$f":"M324+I325","v":0},{"$error":"#VALUE!"},{"$error":"#VALUE!"},{"$f":"IF(M325<=$B$3,I325,0)","v":0},{"$error":"#VALUE!"},{"$error":"#VALUE!"},0,{"$error":"#VALUE!"},{"$f":"IF(S325<='Collection System Summary_Table'!$I$8,\"Yes\",\"NO\")","v":"Yes"}]
[null,null,null,null,null,null,null,null,null,null,null,null,0,{"$error":"#VALUE!"},{"$error":"#VALUE!"},0,{"$error":"#VALUE!"},{"$error":"#VALUE!"},0,{"$error":"#VALUE!"},{"$f":"IF(S326<='Collection System Summary_Table'!$I$8,\"Yes\",\"NO\")","v":"Yes"}]
[null,null,null,null,null,null,null,null,null,null,null,null,0,{"$error":"#VALUE!"},{"$error":"#VALUE!"},0,{"$error":"#VALUE!"},{"$error":"#VALUE!"},0,{"$error":"#VALUE!"},{"$f":"IF(S327<='Collection System Summary_Table'!$I$8,\"Yes\",\"NO\")","v":"Yes"}]
[null,null,null,null,null,null,null,null,null,null,null,null,0,{"$error":"#VALUE!"},{"$error":"#VALUE!"},0,{"$error":"#VALUE!"},{"$error":"#VALUE!"},0,{"$error":"#VALUE!"},{"$f":"IF(S328<='Collection System Summary_Table'!$I$8,\"Yes\",\"NO\")","v":"Yes"}]
[null,null,null,null,null,null,null,null,null,null,null,null,0,{"$error":"#VALUE!"},{"$error":"#VALUE!"},0,{"$error":"#VALUE!"},{"$error":"#VALUE!"},0,{"$error":"#VALUE!"},{"$f":"IF(S329<='Collection System Summary_Table'!$I$8,\"Yes\",\"NO\")","v":"Yes"}]
[null,null,null,null,null,null,null,null,null,null,null,null,0,{"$error":"#VALUE!"},{"$error":"#VALUE!"},0,{"$error":"#VALUE!"},{"$error":"#VALUE!"},0,{"$error":"#VALUE!"},{"$f":"IF(S330<='Collection System Summary_Table'!$I$8,\"Yes\",\"NO\")","v":"Yes"}]
[null,null,null,null,null,null,null,null,null,null,null,null,0,{"$error":"#VALUE!"},{"$error":"#VALUE!"},0,{"$error":"#VALUE!"},{"$error":"#VALUE!"},0,{"$error":"#VALUE!"},{"$f":"IF(S331<='Collection System Summary_Table'!$I$8,\"Yes\",\"NO\")","v":"Yes"}]
[null,null,null,null,null,null,null,null,null,null,null,null,0,{"$error":"#VALUE!"},{"$error":"#VALUE!"},0,{"$error":"#VALUE!"},{"$error":"#VALUE!"},0,{"$error":"#VALUE!"},{"$f":"IF(S332<='Collection System Summary_Table'!$I$8,\"Yes\",\"NO\")","v":"Yes"}]
[null,null,null,null,null,null,null,null,null,null,null,null,0,{"$error":"#VALUE!"},{"$error":"#VALUE!"},0,{"$error":"#VALUE!"},{"$error":"#VALUE!"},0,{"$error":"#VALUE!"},{"$f":"IF(S333<='Collection System Summary_Table'!$I$8,\"Yes\",\"NO\")","v":"Yes"}]
[null,null,null,null,null,null,null,null,null,null,null,null,0,{"$error":"#VALUE!"},{"$error":"#VALUE!"},0,{"$error":"#VALUE!"},{"$error":"#VALUE!"},0,{"$error":"#VALUE!"},{"$f":"IF(S334<='Collection System Summary_Table'!$I$8,\"Yes\",\"NO\")","v":"Yes"}]
[null,null,null,null,null,null,null,null,null,null,null,null,0,{"$error":"#VALUE!"},{"$error":"#VALUE!"},0,{"$error":"#VALUE!"},{"$error":"#VALUE!"},0,{"$error":"#VALUE!"},{"$f":"IF(S335<='Collection System Summary_Table'!$I$8,\"Yes\",\"NO\")","v":"Yes"}]
[null,null,null,null,null,null,null,null,null,null,null,null,0,{"$error":"#VALUE!"},{"$error":"#VALUE!"},0,{"$error":"#VALUE!"},{"$error":"#VALUE!"},0,{"$error":"#VALUE!"},{"$f":"IF(S336<='Collection System Summary_Table'!$I$8,\"Yes\",\"NO\")","v":"Yes"}]
[null,null,null,null,null,null,null,null,null,null,null,null,0,{"$error":"#VALUE!"},{"$error":"#VALUE!"},0,{"$error":"#VALUE!"},{"$error":"#VALUE!"},0,{"$error":"#VALUE!"},{"$f":"IF(S337<='Collection System Summary_Table'!$I$8,\"Yes\",\"NO\")","v":"Yes"}]
[null,null,null,null,null,null,null,null,null,null,null,null,0,{"$error":"#VALUE!"},{"$error":"#VALUE!"},0,{"$error":"#VALUE!"},{"$error":"#VALUE!"},0,{"$error":"#VALUE!"},{"$f":"IF(S338<='Collection System Summary_Table'!$I$8,\"Yes\",\"NO\")","v":"Yes"}]
[null,null,null,null,null,null,null,null,null,null,null,null,0,{"$error":"#VALUE!"},{"$error":"#VALUE!"},0,{"$error":"#VALUE!"},{"$error":"#VALUE!"},0,{"$error":"#VALUE!"},{"$f":"IF(S339<='Collection System Summary_Table'!$I$8,\"Yes\",\"NO\")","v":"Yes"}]
[null,null,null,null,null,null,null,null,null,null,null,null,0,{"$error":"#VALUE!"},{"$error":"#VALUE!"},0,{"$error":"#VALUE!"},{"$error":"#VALUE!"},0,{"$error":"#VALUE!"},{"$f":"IF(S340<='Collection System Summary_Table'!$I$8,\"Yes\",\"NO\")","v":"Yes"}]
[null,null,null,null,null,null,null,null,null,null,null,null,0,{"$error":"#VALUE!"},{"$error":"#VALUE!"},0,{"$error":"#VALUE!"},{"$error":"#VALUE!"},0,{"$error":"#VALUE!"},{"$f":"IF(S341<='Collection System Summary_Table'!$I$8,\"Yes\",\"NO\")","v":"Yes"}]
[null,null,null,null,null,null,null,null,null,null,null,null,0,{"$error":"#VALUE!"},{"$error":"#VALUE!"},0,{"$error":"#VALUE!"},{"$error":"#VALUE!"},0,{"$error":"#VALUE!"},{"$f":"IF(S342<='Collection System Summary_Table'!$I$8,\"Yes\",\"NO\")","v":"Yes"}]
[null,null,null,null,null,null,null,null,null,null,null,null,0,{"$error":"#VALUE!"},{"$error":"#VALUE!"},0,{"$error":"#VALUE!"},{"$error":"#VALUE!"},0,{"$error":"#VALUE!"},{"$f":"IF(S343<='Collection System Summary_Table'!$I$8,\"Yes\",\"NO\")","v":"Yes"}]
[null,null,null,null,null,null,null,null,null,null,null,null,0,{"$error":"#VALUE!"},{"$error":"#VALUE!"},0,{"$error":"#VALUE!"},{"$error":"#VALUE!"},0,{"$error":"#VALUE!"},{"$f":"IF(S344<='Collection System Summary_Table'!$I$8,\"Yes\",\"NO\")","v":"Yes"}]
[null,null,null,null,null,null,null,null,null,null,null,null,0,{"$error":"#VALUE!"},{"$error":"#VALUE!"},0,{"$error":"#VALUE!"},{"$error":"#VALUE!"},0,{"$error":"#VALUE!"},{"$f":"IF(S345<='Collection System Summary_Table'!$I$8,\"Yes\",\"NO\")","v":"Yes"}]
[null,null,null,null,null,null,null,null,null,null,null,null,0,{"$error":"#VALUE!"},{"$error":"#VALUE!"},0,{"$error":"#VALUE!"},{"$error":"#VALUE!"},0,{"$error":"#VALUE!"},{"$f":"IF(S346<='Collection System Summary_Table'!$I$8,\"Yes\",\"NO\")","v":"Yes"}]
[null,null,null,null,null,null,null,null,null,null,null,null,0,{"$error":"#VALUE!"},{"$error":"#VALUE!"},0,{"$error":"#VALUE!"},{"$error":"#VALUE!"},0,{"$error":"#VALUE!"},{"$f":"IF(S347<='Collection System Summary_Table'!$I$8,\"Yes\",\"NO\")","v":"Yes"}]
[null,null,null,null,null,null,null,null,null,null,null,null,0,{"$error":"#VALUE!"},{"$error":"#VALUE!"},0,{"$error":"#VALUE!"},{"$error":"#VALUE!"},0,{"$error":"#VALUE!"},{"$f":"IF(S348<='Collection System Summary_Table'!$I$8,\"Yes\",\"NO\")","v":"Yes"}]
[null,null,null,null,null,null,null,null,null,null,null,null,0,{"$error":"#VALUE!"},{"$error":"#VALUE!"},0,{"$error":"#VALUE!"},{"$error":"#VALUE!"},0,{"$error":"#VALUE!"},{"$f":"IF(S349<='Collection System Summary_Table'!$I$8,\"Yes\",\"NO\")","v":"Yes"}]
[null,null,null,null,null,null,null,null,null,null,null,null,0,{"$error":"#VALUE!"},{"$error":"#VALUE!"},0,{"$error":"#VALUE!"},{"$error":"#VALUE!"},0,{"$error":"#VALUE!"},{"$f":"IF(S350<='Collection System Summary_Table'!$I$8,\"Yes\",\"NO\")","v":"Yes"}]
[null,null,null,null,null,null,null,null,null,null,null,null,0,{"$error":"#VALUE!"},{"$error":"#VALUE!"},0,{"$error":"#VALUE!"},{"$error":"#VALUE!"},0,{"$error":"#VALUE!"},{"$f":"IF(S351<='Collection System Summary_Table'!$I$8,\"Yes\",\"NO\")","v":"Yes"}]
[null,null,null,null,null,null,null,null,null,null,null,null,0,{"$error":"#VALUE!"},{"$error":"#VALUE!"},0,{"$error":"#VALUE!"},{"$error":"#VALUE!"},0,{"$error":"#VALUE!"},{"$f":"IF(S352<='Collection System Summary_Table'!$I$8,\"Yes\",\"NO\")","v":"Yes"}]
[null,null,null,null,null,null,null,null,null,null,null,null,0,{"$error":"#VALUE!"},{"$error":"#VALUE!"},0,{"$error":"#VALUE!"},{"$error":"#VALUE!"},0,{"$error":"#VALUE!"},{"$f":"IF(S353<='Collection System Summary_Table'!$I$8,\"Yes\",\"NO\")","v":"Yes"}]
[null,null,null,null,null,null,null,null,null,null,null,null,0,{"$error":"#VALUE!"},{"$error":"#VALUE!"},0,{"$error":"#VALUE!"},{"$error":"#VALUE!"},0,{"$error":"#VALUE!"},{"$f":"IF(S354<='Collection System Summary_Table'!$I$8,\"Yes\",\"NO\")","v":"Yes"}]
[null,null,null,null,null,null,null,null,null,null,null,null,0,{"$error":"#VALUE!"},{"$error":"#VALUE!"},0,{"$error":"#VALUE!"},{"$error":"#VALUE!"},0,{"$error":"#VALUE!"},{"$f":"IF(S355<='Collection System Summary_Table'!$I$8,\"Yes\",\"NO\")","v":"Yes"}]
[null,null,null,null,null,null,null,null,null,null,null,null,0,{"$error":"#VALUE!"},{"$error":"#VALUE!"},0,{"$error":"#VALUE!"},{"$error":"#VALUE!"},0,{"$error":"#VALUE!"},{"$f":"IF(S356<='Collection System Summary_Table'!$I$8,\"Yes\",\"NO\")","v":"Yes"}]
[null,null,null,null,null,null,null,null,null,null,null,null,0,{"$error":"#VALUE!"},{"$error":"#VALUE!"},0,{"$error":"#VALUE!"},{"$error":"#VALUE!"},0,{"$error":"#VALUE!"},{"$f":"IF(S357<='Collection System Summary_Table'!$I$8,\"Yes\",\"NO\")","v":"Yes"}]
[null,null,null,null,null,null,null,null,null,null,null,null,0,{"$error":"#VALUE!"},{"$error":"#VALUE!"},0,{"$error":"#VALUE!"},{"$error":"#VALUE!"},0,{"$error":"#VALUE!"},{"$f":"IF(S358<='Collection System Summary_Table'!$I$8,\"Yes\",\"NO\")","v":"Yes"}]
[null,null,null,null,null,null,null,null,null,null,null,null,0,{"$error":"#VALUE!"},{"$error":"#VALUE!"},0,{"$error":"#VALUE!"},{"$error":"#VALUE!"},0,{"$error":"#VALUE!"},{"$f":"IF(S359<='Collection System Summary_Table'!$I$8,\"Yes\",\"NO\")","v":"Yes"}]
[null,null,null,null,null,null,null,null,null,null,null,null,0,{"$error":"#VALUE!"},{"$error":"#VALUE!"},0,{"$error":"#VALUE!"},{"$error":"#VALUE!"},0,{"$error":"#VALUE!"},{"$f":"IF(S360<='Collection System Summary_Table'!$I$8,\"Yes\",\"NO\")","v":"Yes"}]
[null,null,null,null,null,null,null,null,null,null,null,null,0,{"$error":"#VALUE!"},{"$error":"#VALUE!"},0,{"$error":"#VALUE!"},{"$error":"#VALUE!"},0,{"$error":"#VALUE!"},{"$f":"IF(S361<='Collection System Summary_Table'!$I$8,\"Yes\",\"NO\")","v":"Yes"}]
[null,null,null,null,null,null,null,null,null,null,null,null,0,{"$error":"#VALUE!"},{"$error":"#VALUE!"},0,{"$error":"#VALUE!"},{"$error":"#VALUE!"},0,{"$error":"#VALUE!"},{"$f":"IF(S362<='Collection System Summary_Table'!$I$8,\"Yes\",\"NO\")","v":"Yes"}]
[null,null,null,null,null,null,null,null,null,null,null,null,0,{"$error":"#VALUE!"},{"$error":"#VALUE!"},0,{"$error":"#VALUE!"},{"$error":"#VALUE!"},0,{"$error":"#VALUE!"},{"$f":"IF(S363<='Collection System Summary_Table'!$I$8,\"Yes\",\"NO\")","v":"Yes"}]
[null,null,null,null,null,null,null,null,null,null,null,null,0,{"$error":"#VALUE!"},{"$error":"#VALUE!"},0,{"$error":"#VALUE!"},{"$error":"#VALUE!"},0,{"$error":"#VALUE!"},{"$f":"IF(S364<='Collection System Summary_Table'!$I$8,\"Yes\",\"NO\")","v":"Yes"}]
[null,null,null,null,null,null,null,null,null,null,null,null,0,{"$error":"#VALUE!"},{"$error":"#VALUE!"},0,{"$error":"#VALUE!"},{"$error":"#VALUE!"},0,{"$error":"#VALUE!"},{"$f":"IF(S365<='Collection System Summary_Table'!$I$8,\"Yes\",\"NO\")","v":"Yes"}]
[null,null,null,null,null,null,null,null,null,null,null,null,0,{"$error":"#VALUE!"},{"$error":"#VALUE!"},0,{"$error":"#VALUE!"},{"$error":"#VALUE!"},0,{"$error":"#VALUE!"},{"$f":"IF(S366<='Collection System Summary_Table'!$I$8,\"Yes\",\"NO\")","v":"Yes"}]
[null,null,null,null,null,null,null,null,null,null,null,null,0,{"$error":"#VALUE!"},{"$error":"#VALUE!"},0,{"$error":"#VALUE!"},{"$error":"#VALUE!"},0,{"$error":"#VALUE!"},{"$f":"IF(S367<='Collection System Summary_Table'!$I$8,\"Yes\",\"NO\")","v":"Yes"}]
[null,null,null,null,null,null,null,null,null,null,null,null,0,{"$error":"#VALUE!"},{"$error":"#VALUE!"},0,{"$error":"#VALUE!"},{"$error":"#VALUE!"},0,{"$error":"#VALUE!"},{"$f":"IF(S368<='Collection System Summary_Table'!$I$8,\"Yes\",\"NO\")","v":"Yes"}]
[null,null,null,null,null,null,null,null,null,null,null,null,0,{"$error":"#VALUE!"},{"$error":"#VALUE!"},0,{"$error":"#VALUE!"},{"$error":"#VALUE!"},0,{"$error":"#VALUE!"},{"$f":"IF(S369<='Collection System Summary_Table'!$I$8,\"Yes\",\"NO\")","v":"Yes"}]
[null,null,null,null,null,null,null,null,null,null,null,null,0,{"$error":"#VALUE!"},{"$error":"#VALUE!"},0,{"$error":"#VALUE!"},{"$error":"#VALUE!"},0,{"$error":"#VALUE!"},{"$f":"IF(S370<='Collection System Summary_Table'!$I$8,\"Yes\",\"NO\")","v":"Yes"}]
[null,null,null,null,null,null,null,null,null,null,null,null,0,{"$error":"#VALUE!"},{"$error":"#VALUE!"},0,{"$error":"#VALUE!"},{"$error":"#VALUE!"},0,{"$error":"#VALUE!"},{"$f":"IF(S371<='Collection System Summary_Table'!$I$8,\"Yes\",\"NO\")","v":"Yes"}]
[null,null,null,null,null,null,null,null,null,null,null,null,0,{"$error":"#VALUE!"},{"$error":"#VALUE!"},0,{"$error":"#VALUE!"},{"$error":"#VALUE!"},0,{"$error":"#VALUE!"},{"$f":"IF(S372<='Collection System Summary_Table'!$I$8,\"Yes\",\"NO\")","v":"Yes"}]
[null,null,null,null,null,null,null,null,null,null,null,null,0,{"$error":"#VALUE!"},{"$error":"#VALUE!"},0,{"$error":"#VALUE!"},{"$error":"#VALUE!"},0,{"$error":"#VALUE!"},{"$f":"IF(S373<='Collection System Summary_Table'!$I$8,\"Yes\",\"NO\")","v":"Yes"}]
[null,null,null,null,null,null,null,null,null,null,null,null,0,{"$error":"#VALUE!"},{"$error":"#VALUE!"},0,{"$error":"#VALUE!"},{"$error":"#VALUE!"},0,{"$error":"#VALUE!"},{"$f":"IF(S374<='Collection System Summary_Table'!$I$8,\"Yes\",\"NO\")","v":"Yes"}]
[null,null,null,null,null,null,null,null,null,null,null,null,0,{"$error":"#VALUE!"},{"$error":"#VALUE!"},0,{"$error":"#VALUE!"},{"$error":"#VALUE!"},0,{"$error":"#VALUE!"},{"$f":"IF(S375<='Collection System Summary_Table'!$I$8,\"Yes\",\"NO\")","v":"Yes"}]
[null,null,null,null,null,null,null,null,null,null,null,null,0,{"$error":"#VALUE!"},{"$error":"#VALUE!"},0,{"$error":"#VALUE!"},{"$error":"#VALUE!"},0,{"$error":"#VALUE!"},{"$f":"IF(S376<='Collection System Summary_Table'!$I$8,\"Yes\",\"NO\")","v":"Yes"}]
[null,null,null,null,null,null,null,null,null,null,null,null,0,{"$error":"#VALUE!"},{"$error":"#VALUE!"},0,{"$error":"#VALUE!"},{"$error":"#VALUE!"},0,{"$error":"#VALUE!"},{"$f":"IF(S377<='Collection System Summary_Table'!$I$8,\"Yes\",\"NO\")","v":"Yes"}]
[null,null,null,null,null,null,null,null,null,null,null,null,0,{"$error":"#VALUE!"},{"$error":"#VALUE!"},0,{"$error":"#VALUE!"},{"$error":"#VALUE!"},0,{"$error":"#VALUE!"},{"$f":"IF(S378<='Collection System Summary_Table'!$I$8,\"Yes\",\"NO\")","v":"Yes"}]
[null,null,null,null,null,null,null,null,null,null,null,null,0,{"$error":"#VALUE!"},{"$error":"#VALUE!"},0,{"$error":"#VALUE!"},{"$error":"#VALUE!"},0,{"$error":"#VALUE!"},{"$f":"IF(S379<='Collection System Summary_Table'!$I$8,\"Yes\",\"NO\")","v":"Yes"}]
[null,null,null,null,null,null,null,null,null,null,null,null,0,{"$error":"#VALUE!"},{"$error":"#VALUE!"},0,{"$error":"#VALUE!"},{"$error":"#VALUE!"},0,{"$error":"#VALUE!"},{"$f":"IF(S380<='Collection System Summary_Table'!$I$8,\"Yes\",\"NO\")","v":"Yes"}]
[null,null,null,null,null,null,null,null,null,null,null,null,0,{"$error":"#VALUE!"},{"$error":"#VALUE!"},0,{"$error":"#VALUE!"},{"$error":"#VALUE!"},0,{"$error":"#VALUE!"},{"$f":"IF(S381<='Collection System Summary_Table'!$I$8,\"Yes\",\"NO\")","v":"Yes"}]
[null,null,null,null,null,null,null,null,null,null,null,null,0,{"$error":"#VALUE!"},{"$error":"#VALUE!"},0,{"$error":"#VALUE!"},{"$error":"#VALUE!"},0,{"$error":"#VALUE!"},{"$f":"IF(S382<='Collection System Summary_Table'!$I$8,\"Yes\",\"NO\")","v":"Yes"}]
[null,null,null,null,null,null,null,null,null,null,null,null,0,{"$error":"#VALUE!"},{"$error":"#VALUE!"},0,{"$error":"#VALUE!"},{"$error":"#VALUE!"},0,{"$error":"#VALUE!"},{"$f":"IF(S383<='Collection System Summary_Table'!$I$8,\"Yes\",\"NO\")","v":"Yes"}]
[null,null,null,null,null,null,null,null,null,null,null,null,0,{"$error":"#VALUE!"},{"$error":"#VALUE!"},0,{"$error":"#VALUE!"},{"$error":"#VALUE!"},0,{"$error":"#VALUE!"},{"$f":"IF(S384<='Collection System Summary_Table'!$I$8,\"Yes\",\"NO\")","v":"Yes"}]
[null,null,null,null,null,null,null,null,null,null,null,null,0,{"$error":"#VALUE!"},{"$error":"#VALUE!"},0,{"$error":"#VALUE!"},{"$error":"#VALUE!"},0,{"$error":"#VALUE!"},{"$f":"IF(S385<='Collection System Summary_Table'!$I$8,\"Yes\",\"NO\")","v":"Yes"}]
[null,null,null,null,null,null,null,null,null,null,null,null,0,{"$error":"#VALUE!"},{"$error":"#VALUE!"},0,{"$error":"#VALUE!"},{"$error":"#VALUE!"},0,{"$error":"#VALUE!"},{"$f":"IF(S386<='Collection System Summary_Table'!$I$8,\"Yes\",\"NO\")","v":"Yes"}]
[null,null,null,null,null,null,null,null,null,null,null,null,0,{"$f":"IF(P387=0,I387+N386,0)","v":{"$error":"#VALUE!"}},{"$error":"#VALUE!"},0,{"$error":"#VALUE!"},{"$error":"#VALUE!"},0,{"$error":"#VALUE!"},{"$f":"IF(S387<='Collection System Summary_Table'!$I$8,\"Yes\",\"NO\")","v":"Yes"}]
[null,null,null,null,null,null,null,null,null,null,null,null,0,{"$error":"#VALUE!"},{"$f":"IF(AND(Q388=0,P388=0),K388+O387,0)","v":{"$error":"#VALUE!"}},0,{"$f":"IF(AND(P388=0,N388<($B$4+$P$1)),J388,0)","v":{"$error":"#VALUE!"}},{"$f":"IF(AND(P388=0,Q388=0,O388<($B$5+$Q$1)),K388,0)","v":{"$error":"#VALUE!"}},{"$f":"S387+L388","v":0},{"$f":"IF(OR(P388>1,Q388>1,R388>1),\"YES\",\"NO\")","v":{"$error":"#VALUE!"}},{"$f":"IF(S388<='Collection System Summary_Table'!$I$8,\"Yes\",\"NO\")","v":"Yes"}]
[null,null,null,null,null,null,null,null,null,null,null,null,{"$f":"M388+I389","v":0},{"$error":"#VALUE!"},{"$error":"#VALUE!"},{"$f":"IF(M389<=$B$3,I389,0)","v":0},{"$error":"#VALUE!"},{"$error":"#VALUE!"},0,{"$error":"#VALUE!"},{"$f":"IF(S389<='Collection System Summary_Table'!$I$8,\"Yes\",\"NO\")","v":"Yes"}]
[null,null,null,null,null,null,null,null,null,null,null,null,0,{"$error":"#VALUE!"},{"$error":"#VALUE!"},0,{"$error":"#VALUE!"},{"$error":"#VALUE!"},0,{"$error":"#VALUE!"},{"$f":"IF(S390<='Collection System Summary_Table'!$I$8,\"Yes\",\"NO\")","v":"Yes"}]
[null,null,null,null,null,null,null,null,null,null,null,null,0,{"$error":"#VALUE!"},{"$error":"#VALUE!"},0,{"$error":"#VALUE!"},{"$error":"#VALUE!"},0,{"$error":"#VALUE!"},{"$f":"IF(S391<='Collection System Summary_Table'!$I$8,\"Yes\",\"NO\")","v":"Yes"}]
[null,null,null,null,null,null,null,null,null,null,null,null,0,{"$error":"#VALUE!"},{"$error":"#VALUE!"},0,{"$error":"#VALUE!"},{"$error":"#VALUE!"},0,{"$error":"#VALUE!"},{"$f":"IF(S392<='Collection System Summary_Table'!$I$8,\"Yes\",\"NO\")","v":"Yes"}]
[null,null,null,null,null,null,null,null,null,null,null,null,0,{"$error":"#VALUE!"},{"$error":"#VALUE!"},0,{"$error":"#VALUE!"},{"$error":"#VALUE!"},0,{"$error":"#VALUE!"},{"$f":"IF(S393<='Collection System Summary_Table'!$I$8,\"Yes\",\"NO\")","v":"Yes"}]
[null,null,null,null,null,null,null,null,null,null,null,null,0,{"$error":"#VALUE!"},{"$error":"#VALUE!"},0,{"$error":"#VALUE!"},{"$error":"#VALUE!"},0,{"$error":"#VALUE!"},{"$f":"IF(S394<='Collection System Summary_Table'!$I$8,\"Yes\",\"NO\")","v":"Yes"}]
[null,null,null,null,null,null,null,null,null,null,null,null,0,{"$error":"#VALUE!"},{"$error":"#VALUE!"},0,{"$error":"#VALUE!"},{"$error":"#VALUE!"},0,{"$error":"#VALUE!"},{"$f":"IF(S395<='Collection System Summary_Table'!$I$8,\"Yes\",\"NO\")","v":"Yes"}]
[null,null,null,null,null,null,null,null,null,null,null,null,0,{"$error":"#VALUE!"},{"$error":"#VALUE!"},0,{"$error":"#VALUE!"},{"$error":"#VALUE!"},0,{"$error":"#VALUE!"},{"$f":"IF(S396<='Collection System Summary_Table'!$I$8,\"Yes\",\"NO\")","v":"Yes"}]
[null,null,null,null,null,null,null,null,null,null,null,null,0,{"$error":"#VALUE!"},{"$error":"#VALUE!"},0,{"$error":"#VALUE!"},{"$error":"#VALUE!"},0,{"$error":"#VALUE!"},{"$f":"IF(S397<='Collection System Summary_Table'!$I$8,\"Yes\",\"NO\")","v":"Yes"}]
[null,null,null,null,null,null,null,null,null,null,null,null,0,{"$error":"#VALUE!"},{"$error":"#VALUE!"},0,{"$error":"#VALUE!"},{"$error":"#VALUE!"},0,{"$error":"#VALUE!"},{"$f":"IF(S398<='Collection System Summary_Table'!$I$8,\"Yes\",\"NO\")","v":"Yes"}]
[null,null,null,null,null,null,null,null,null,null,null,null,0,{"$error":"#VALUE!"},{"$error":"#VALUE!"},0,{"$error":"#VALUE!"},{"$error":"#VALUE!"},0,{"$error":"#VALUE!"},{"$f":"IF(S399<='Collection System Summary_Table'!$I$8,\"Yes\",\"NO\")","v":"Yes"}]
[null,null,null,null,null,null,null,null,null,null,null,null,0,{"$error":"#VALUE!"},{"$error":"#VALUE!"},0,{"$error":"#VALUE!"},{"$error":"#VALUE!"},0,{"$error":"#VALUE!"},{"$f":"IF(S400<='Collection System Summary_Table'!$I$8,\"Yes\",\"NO\")","v":"Yes"}]
[null,null,null,null,null,null,null,null,null,null,null,null,0,{"$error":"#VALUE!"},{"$error":"#VALUE!"},0,{"$error":"#VALUE!"},{"$error":"#VALUE!"},0,{"$error":"#VALUE!"},{"$f":"IF(S401<='Collection System Summary_Table'!$I$8,\"Yes\",\"NO\")","v":"Yes"}]
[null,null,null,null,null,null,null,null,null,null,null,null,0,{"$error":"#VALUE!"},{"$error":"#VALUE!"},0,{"$error":"#VALUE!"},{"$error":"#VALUE!"},0,{"$error":"#VALUE!"},{"$f":"IF(S402<='Collection System Summary_Table'!$I$8,\"Yes\",\"NO\")","v":"Yes"}]
[null,null,null,null,null,null,null,null,null,null,null,null,0,{"$error":"#VALUE!"},{"$error":"#VALUE!"},0,{"$error":"#VALUE!"},{"$error":"#VALUE!"},0,{"$error":"#VALUE!"},{"$f":"IF(S403<='Collection System Summary_Table'!$I$8,\"Yes\",\"NO\")","v":"Yes"}]
[null,null,null,null,null,null,null,null,null,null,null,null,0,{"$error":"#VALUE!"},{"$error":"#VALUE!"},0,{"$error":"#VALUE!"},{"$error":"#VALUE!"},0,{"$error":"#VALUE!"},{"$f":"IF(S404<='Collection System Summary_Table'!$I$8,\"Yes\",\"NO\")","v":"Yes"}]
[null,null,null,null,null,null,null,null,null,null,null,null,0,{"$error":"#VALUE!"},{"$error":"#VALUE!"},0,{"$error":"#VALUE!"},{"$error":"#VALUE!"},0,{"$error":"#VALUE!"},{"$f":"IF(S405<='Collection System Summary_Table'!$I$8,\"Yes\",\"NO\")","v":"Yes"}]
[null,null,null,null,null,null,null,null,null,null,null,null,0,{"$error":"#VALUE!"},{"$error":"#VALUE!"},0,{"$error":"#VALUE!"},{"$error":"#VALUE!"},0,{"$error":"#VALUE!"},{"$f":"IF(S406<='Collection System Summary_Table'!$I$8,\"Yes\",\"NO\")","v":"Yes"}]
[null,null,null,null,null,null,null,null,null,null,null,null,0,{"$error":"#VALUE!"},{"$error":"#VALUE!"},0,{"$error":"#VALUE!"},{"$error":"#VALUE!"},0,{"$error":"#VALUE!"},{"$f":"IF(S407<='Collection System Summary_Table'!$I$8,\"Yes\",\"NO\")","v":"Yes"}]
[null,null,null,null,null,null,null,null,null,null,null,null,0,{"$error":"#VALUE!"},{"$error":"#VALUE!"},0,{"$error":"#VALUE!"},{"$error":"#VALUE!"},0,{"$error":"#VALUE!"},{"$f":"IF(S408<='Collection System Summary_Table'!$I$8,\"Yes\",\"NO\")","v":"Yes"}]
[null,null,null,null,null,null,null,null,null,null,null,null,0,{"$error":"#VALUE!"},{"$error":"#VALUE!"},0,{"$error":"#VALUE!"},{"$error":"#VALUE!"},0,{"$error":"#VALUE!"},{"$f":"IF(S409<='Collection System Summary_Table'!$I$8,\"Yes\",\"NO\")","v":"Yes"}]
[null,null,null,null,null,null,null,null,null,null,null,null,0,{"$error":"#VALUE!"},{"$error":"#VALUE!"},0,{"$error":"#VALUE!"},{"$error":"#VALUE!"},0,{"$error":"#VALUE!"},{"$f":"IF(S410<='Collection System Summary_Table'!$I$8,\"Yes\",\"NO\")","v":"Yes"}]
[null,null,null,null,null,null,null,null,null,null,null,null,0,{"$error":"#VALUE!"},{"$error":"#VALUE!"},0,{"$error":"#VALUE!"},{"$error":"#VALUE!"},0,{"$error":"#VALUE!"},{"$f":"IF(S411<='Collection System Summary_Table'!$I$8,\"Yes\",\"NO\")","v":"Yes"}]
[null,null,null,null,null,null,null,null,null,null,null,null,0,{"$error":"#VALUE!"},{"$error":"#VALUE!"},0,{"$error":"#VALUE!"},{"$error":"#VALUE!"},0,{"$error":"#VALUE!"},{"$f":"IF(S412<='Collection System Summary_Table'!$I$8,\"Yes\",\"NO\")","v":"Yes"}]
[null,null,null,null,null,null,null,null,null,null,null,null,0,{"$error":"#VALUE!"},{"$error":"#VALUE!"},0,{"$error":"#VALUE!"},{"$error":"#VALUE!"},0,{"$error":"#VALUE!"},{"$f":"IF(S413<='Collection System Summary_Table'!$I$8,\"Yes\",\"NO\")","v":"Yes"}]
[null,null,null,null,null,null,null,null,null,null,null,null,0,{"$error":"#VALUE!"},{"$error":"#VALUE!"},0,{"$error":"#VALUE!"},{"$error":"#VALUE!"},0,{"$error":"#VALUE!"},{"$f":"IF(S414<='Collection System Summary_Table'!$I$8,\"Yes\",\"NO\")","v":"Yes"}]
[null,null,null,null,null,null,null,null,null,null,null,null,0,{"$error":"#VALUE!"},{"$error":"#VALUE!"},0,{"$error":"#VALUE!"},{"$error":"#VALUE!"},0,{"$error":"#VALUE!"},{"$f":"IF(S415<='Collection System Summary_Table'!$I$8,\"Yes\",\"NO\")","v":"Yes"}]
[null,null,null,null,null,null,null,null,null,null,null,null,0,{"$error":"#VALUE!"},{"$error":"#VALUE!"},0,{"$error":"#VALUE!"},{"$error":"#VALUE!"},0,{"$error":"#VALUE!"},{"$f":"IF(S416<='Collection System Summary_Table'!$I$8,\"Yes\",\"NO\")","v":"Yes"}]
[null,null,null,null,null,null,null,null,null,null,null,null,0,{"$error":"#VALUE!"},{"$error":"#VALUE!"},0,{"$error":"#VALUE!"},{"$error":"#VALUE!"},0,{"$error":"#VALUE!"},{"$f":"IF(S417<='Collection System Summary_Table'!$I$8,\"Yes\",\"NO\")","v":"Yes"}]
[null,null,null,null,null,null,null,null,null,null,null,null,0,{"$error":"#VALUE!"},{"$error":"#VALUE!"},0,{"$error":"#VALUE!"},{"$error":"#VALUE!"},0,{"$error":"#VALUE!"},{"$f":"IF(S418<='Collection System Summary_Table'!$I$8,\"Yes\",\"NO\")","v":"Yes"}]
[null,null,null,null,null,null,null,null,null,null,null,null,0,{"$error":"#VALUE!"},{"$error":"#VALUE!"},0,{"$error":"#VALUE!"},{"$error":"#VALUE!"},0,{"$error":"#VALUE!"},{"$f":"IF(S419<='Collection System Summary_Table'!$I$8,\"Yes\",\"NO\")","v":"Yes"}]
[null,null,null,null,null,null,null,null,null,null,null,null,0,{"$error":"#VALUE!"},{"$error":"#VALUE!"},0,{"$error":"#VALUE!"},{"$error":"#VALUE!"},0,{"$error":"#VALUE!"},{"$f":"IF(S420<='Collection System Summary_Table'!$I$8,\"Yes\",\"NO\")","v":"Yes"}]
[null,null,null,null,null,null,null,null,null,null,null,null,0,{"$error":"#VALUE!"},{"$error":"#VALUE!"},0,{"$error":"#VALUE!"},{"$error":"#VALUE!"},0,{"$error":"#VALUE!"},{"$f":"IF(S421<='Collection System Summary_Table'!$I$8,\"Yes\",\"NO\")","v":"Yes"}]
[null,null,null,null,null,null,null,null,null,null,null,null,0,{"$error":"#VALUE!"},{"$error":"#VALUE!"},0,{"$error":"#VALUE!"},{"$error":"#VALUE!"},0,{"$error":"#VALUE!"},{"$f":"IF(S422<='Collection System Summary_Table'!$I$8,\"Yes\",\"NO\")","v":"Yes"}]
[null,null,null,null,null,null,null,null,null,null,null,null,0,{"$error":"#VALUE!"},{"$error":"#VALUE!"},0,{"$error":"#VALUE!"},{"$error":"#VALUE!"},0,{"$error":"#VALUE!"},{"$f":"IF(S423<='Collection System Summary_Table'!$I$8,\"Yes\",\"NO\")","v":"Yes"}]
[null,null,null,null,null,null,null,null,null,null,null,null,0,{"$error":"#VALUE!"},{"$error":"#VALUE!"},0,{"$error":"#VALUE!"},{"$error":"#VALUE!"},0,{"$error":"#VALUE!"},{"$f":"IF(S424<='Collection System Summary_Table'!$I$8,\"Yes\",\"NO\")","v":"Yes"}]
[null,null,null,null,null,null,null,null,null,null,null,null,0,{"$error":"#VALUE!"},{"$error":"#VALUE!"},0,{"$error":"#VALUE!"},{"$error":"#VALUE!"},0,{"$error":"#VALUE!"},{"$f":"IF(S425<='Collection System Summary_Table'!$I$8,\"Yes\",\"NO\")","v":"Yes"}]
[null,null,null,null,null,null,null,null,null,null,null,null,0,{"$error":"#VALUE!"},{"$error":"#VALUE!"},0,{"$error":"#VALUE!"},{"$error":"#VALUE!"},0,{"$error":"#VALUE!"},{"$f":"IF(S426<='Collection System Summary_Table'!$I$8,\"Yes\",\"NO\")","v":"Yes"}]
[null,null,null,null,null,null,null,null,null,null,null,null,0,{"$error":"#VALUE!"},{"$error":"#VALUE!"},0,{"$error":"#VALUE!"},{"$error":"#VALUE!"},0,{"$error":"#VALUE!"},{"$f":"IF(S427<='Collection System Summary_Table'!$I$8,\"Yes\",\"NO\")","v":"Yes"}]
[null,null,null,null,null,null,null,null,null,null,null,null,0,{"$error":"#VALUE!"},{"$error":"#VALUE!"},0,{"$error":"#VALUE!"},{"$error":"#VALUE!"},0,{"$error":"#VALUE!"},{"$f":"IF(S428<='Collection System Summary_Table'!$I$8,\"Yes\",\"NO\")","v":"Yes"}]
[null,null,null,null,null,null,null,null,null,null,null,null,0,{"$error":"#VALUE!"},{"$error":"#VALUE!"},0,{"$error":"#VALUE!"},{"$error":"#VALUE!"},0,{"$error":"#VALUE!"},{"$f":"IF(S429<='Collection System Summary_Table'!$I$8,\"Yes\",\"NO\")","v":"Yes"}]
[null,null,null,null,null,null,null,null,null,null,null,null,0,{"$error":"#VALUE!"},{"$error":"#VALUE!"},0,{"$error":"#VALUE!"},{"$error":"#VALUE!"},0,{"$error":"#VALUE!"},{"$f":"IF(S430<='Collection System Summary_Table'!$I$8,\"Yes\",\"NO\")","v":"Yes"}]
[null,null,null,null,null,null,null,null,null,null,null,null,0,{"$error":"#VALUE!"},{"$error":"#VALUE!"},0,{"$error":"#VALUE!"},{"$error":"#VALUE!"},0,{"$error":"#VALUE!"},{"$f":"IF(S431<='Collection System Summary_Table'!$I$8,\"Yes\",\"NO\")","v":"Yes"}]
[null,null,null,null,null,null,null,null,null,null,null,null,0,{"$error":"#VALUE!"},{"$error":"#VALUE!"},0,{"$error":"#VALUE!"},{"$error":"#VALUE!"},0,{"$error":"#VALUE!"},{"$f":"IF(S432<='Collection System Summary_Table'!$I$8,\"Yes\",\"NO\")","v":"Yes"}]
[null,null,null,null,null,null,null,null,null,null,null,null,0,{"$error":"#VALUE!"},{"$error":"#VALUE!"},0,{"$error":"#VALUE!"},{"$error":"#VALUE!"},0,{"$error":"#VALUE!"},{"$f":"IF(S433<='Collection System Summary_Table'!$I$8,\"Yes\",\"NO\")","v":"Yes"}]
[null,null,null,null,null,null,null,null,null,null,null,null,0,{"$error":"#VALUE!"},{"$error":"#VALUE!"},0,{"$error":"#VALUE!"},{"$error":"#VALUE!"},0,{"$error":"#VALUE!"},{"$f":"IF(S434<='Collection System Summary_Table'!$I$8,\"Yes\",\"NO\")","v":"Yes"}]
[null,null,null,null,null,null,null,null,null,null,null,null,0,{"$error":"#VALUE!"},{"$error":"#VALUE!"},0,{"$error":"#VALUE!"},{"$error":"#VALUE!"},0,{"$error":"#VALUE!"},{"$f":"IF(S435<='Collection System Summary_Table'!$I$8,\"Yes\",\"NO\")","v":"Yes"}]
[null,null,null,null,null,null,null,null,null,null,null,null,0,{"$error":"#VALUE!"},{"$error":"#VALUE!"},0,{"$error":"#VALUE!"},{"$error":"#VALUE!"},0,{"$error":"#VALUE!"},{"$f":"IF(S436<='Collection System Summary_Table'!$I$8,\"Yes\",\"NO\")","v":"Yes"}]
[null,null,null,null,null,null,null,null,null,null,null,null,0,{"$error":"#VALUE!"},{"$error":"#VALUE!"},0,{"$error":"#VALUE!"},{"$error":"#VALUE!"},0,{"$error":"#VALUE!"},{"$f":"IF(S437<='Collection System Summary_Table'!$I$8,\"Yes\",\"NO\")","v":"Yes"}]
[null,null,null,null,null,null,null,null,null,null,null,null,0,{"$error":"#VALUE!"},{"$error":"#VALUE!"},0,{"$error":"#VALUE!"},{"$error":"#VALUE!"},0,{"$error":"#VALUE!"},{"$f":"IF(S438<='Collection System Summary_Table'!$I$8,\"Yes\",\"NO\")","v":"Yes"}]
[null,null,null,null,null,null,null,null,null,null,null,null,0,{"$error":"#VALUE!"},{"$error":"#VALUE!"},0,{"$error":"#VALUE!"},{"$error":"#VALUE!"},0,{"$error":"#VALUE!"},{"$f":"IF(S439<='Collection System Summary_Table'!$I$8,\"Yes\",\"NO\")","v":"Yes"}]
[null,null,null,null,null,null,null,null,null,null,null,null,0,{"$error":"#VALUE!"},{"$error":"#VALUE!"},0,{"$error":"#VALUE!"},{"$error":"#VALUE!"},0,{"$error":"#VALUE!"},{"$f":"IF(S440<='Collection System Summary_Table'!$I$8,\"Yes\",\"NO\")","v":"Yes"}]
[null,null,null,null,null,null,null,null,null,null,null,null,0,{"$error":"#VALUE!"},{"$error":"#VALUE!"},0,{"$error":"#VALUE!"},{"$error":"#VALUE!"},0,{"$error":"#VALUE!"},{"$f":"IF(S441<='Collection System Summary_Table'!$I$8,\"Yes\",\"NO\")","v":"Yes"}]
[null,null,null,null,null,null,null,null,null,null,null,null,0,{"$error":"#VALUE!"},{"$error":"#VALUE!"},0,{"$error":"#VALUE!"},{"$error":"#VALUE!"},0,{"$error":"#VALUE!"},{"$f":"IF(S442<='Collection System Summary_Table'!$I$8,\"Yes\",\"NO\")","v":"Yes"}]
[null,null,null,null,null,null,null,null,null,null,null,null,0,{"$error":"#VALUE!"},{"$error":"#VALUE!"},0,{"$error":"#VALUE!"},{"$error":"#VALUE!"},0,{"$error":"#VALUE!"},{"$f":"IF(S443<='Collection System Summary_Table'!$I$8,\"Yes\",\"NO\")","v":"Yes"}]
[null,null,null,null,null,null,null,null,null,null,null,null,0,{"$error":"#VALUE!"},{"$error":"#VALUE!"},0,{"$error":"#VALUE!"},{"$error":"#VALUE!"},0,{"$error":"#VALUE!"},{"$f":"IF(S444<='Collection System Summary_Table'!$I$8,\"Yes\",\"NO\")","v":"Yes"}]
[null,null,null,null,null,null,null,null,null,null,null,null,0,{"$error":"#VALUE!"},{"$error":"#VALUE!"},0,{"$error":"#VALUE!"},{"$error":"#VALUE!"},0,{"$error":"#VALUE!"},{"$f":"IF(S445<='Collection System Summary_Table'!$I$8,\"Yes\",\"NO\")","v":"Yes"}]
[null,null,null,null,null,null,null,null,null,null,null,null,0,{"$error":"#VALUE!"},{"$error":"#VALUE!"},0,{"$error":"#VALUE!"},{"$error":"#VALUE!"},0,{"$error":"#VALUE!"},{"$f":"IF(S446<='Collection System Summary_Table'!$I$8,\"Yes\",\"NO\")","v":"Yes"}]
[null,null,null,null,null,null,null,null,null,null,null,null,0,{"$error":"#VALUE!"},{"$error":"#VALUE!"},0,{"$error":"#VALUE!"},{"$error":"#VALUE!"},0,{"$error":"#VALUE!"},{"$f":"IF(S447<='Collection System Summary_Table'!$I$8,\"Yes\",\"NO\")","v":"Yes"}]
[null,null,null,null,null,null,null,null,null,null,null,null,0,{"$error":"#VALUE!"},{"$error":"#VALUE!"},0,{"$error":"#VALUE!"},{"$error":"#VALUE!"},0,{"$error":"#VALUE!"},{"$f":"IF(S448<='Collection System Summary_Table'!$I$8,\"Yes\",\"NO\")","v":"Yes"}]
[null,null,null,null,null,null,null,null,null,null,null,null,0,{"$error":"#VALUE!"},{"$error":"#VALUE!"},0,{"$error":"#VALUE!"},{"$error":"#VALUE!"},0,{"$error":"#VALUE!"},{"$f":"IF(S449<='Collection System Summary_Table'!$I$8,\"Yes\",\"NO\")","v":"Yes"}]
[null,null,null,null,null,null,null,null,null,null,null,null,0,{"$error":"#VALUE!"},{"$error":"#VALUE!"},0,{"$error":"#VALUE!"},{"$error":"#VALUE!"},0,{"$error":"#VALUE!"},{"$f":"IF(S450<='Collection System Summary_Table'!$I$8,\"Yes\",\"NO\")","v":"Yes"}]
[null,null,null,null,null,null,null,null,null,null,null,null,0,{"$f":"IF(P451=0,I451+N450,0)","v":{"$error":"#VALUE!"}},{"$error":"#VALUE!"},0,{"$error":"#VALUE!"},{"$error":"#VALUE!"},0,{"$error":"#VALUE!"},{"$f":"IF(S451<='Collection System Summary_Table'!$I$8,\"Yes\",\"NO\")","v":"Yes"}]
[null,null,null,null,null,null,null,null,null,null,null,null,0,{"$error":"#VALUE!"},{"$f":"IF(AND(Q452=0,P452=0),K452+O451,0)","v":{"$error":"#VALUE!"}},0,{"$f":"IF(AND(P452=0,N452<($B$4+$P$1)),J452,0)","v":{"$error":"#VALUE!"}},{"$f":"IF(AND(P452=0,Q452=0,O452<($B$5+$Q$1)),K452,0)","v":{"$error":"#VALUE!"}},{"$f":"S451+L452","v":0},{"$f":"IF(OR(P452>1,Q452>1,R452>1),\"YES\",\"NO\")","v":{"$error":"#VALUE!"}},{"$f":"IF(S452<='Collection System Summary_Table'!$I$8,\"Yes\",\"NO\")","v":"Yes"}]
[null,null,null,null,null,null,null,null,null,null,null,null,{"$f":"M452+I453","v":0},{"$error":"#VALUE!"},{"$error":"#VALUE!"},{"$f":"IF(M453<=$B$3,I453,0)","v":0},{"$error":"#VALUE!"},{"$error":"#VALUE!"},0,{"$error":"#VALUE!"},{"$f":"IF(S453<='Collection System Summary_Table'!$I$8,\"Yes\",\"NO\")","v":"Yes"}]
[null,null,null,null,null,null,null,null,null,null,null,null,0,{"$error":"#VALUE!"},{"$error":"#VALUE!"},0,{"$error":"#VALUE!"},{"$error":"#VALUE!"},0,{"$error":"#VALUE!"},{"$f":"IF(S454<='Collection System Summary_Table'!$I$8,\"Yes\",\"NO\")","v":"Yes"}]
[null,null,null,null,null,null,null,null,null,null,null,null,0,{"$error":"#VALUE!"},{"$error":"#VALUE!"},0,{"$error":"#VALUE!"},{"$error":"#VALUE!"},0,{"$error":"#VALUE!"},{"$f":"IF(S455<='Collection System Summary_Table'!$I$8,\"Yes\",\"NO\")","v":"Yes"}]
[null,null,null,null,null,null,null,null,null,null,null,null,0,{"$error":"#VALUE!"},{"$error":"#VALUE!"},0,{"$error":"#VALUE!"},{"$error":"#VALUE!"},0,{"$error":"#VALUE!"},{"$f":"IF(S456<='Collection System Summary_Table'!$I$8,\"Yes\",\"NO\")","v":"Yes"}]
[null,null,null,null,null,null,null,null,null,null,null,null,0,{"$error":"#VALUE!"},{"$error":"#VALUE!"},0,{"$error":"#VALUE!"},{"$error":"#VALUE!"},0,{"$error":"#VALUE!"},{"$f":"IF(S457<='Collection System Summary_Table'!$I$8,\"Yes\",\"NO\")","v":"Yes"}]
[null,null,null,null,null,null,null,null,null,null,null,null,0,{"$error":"#VALUE!"},{"$error":"#VALUE!"},0,{"$error":"#VALUE!"},{"$error":"#VALUE!"},0,{"$error":"#VALUE!"},{"$f":"IF(S458<='Collection System Summary_Table'!$I$8,\"Yes\",\"NO\")","v":"Yes"}]
[null,null,null,null,null,null,null,null,null,null,null,null,0,{"$error":"#VALUE!"},{"$error":"#VALUE!"},0,{"$error":"#VALUE!"},{"$error":"#VALUE!"},0,{"$error":"#VALUE!"},{"$f":"IF(S459<='Collection System Summary_Table'!$I$8,\"Yes\",\"NO\")","v":"Yes"}]
[null,null,null,null,null,null,null,null,null,null,null,null,0,{"$error":"#VALUE!"},{"$error":"#VALUE!"},0,{"$error":"#VALUE!"},{"$error":"#VALUE!"},0,{"$error":"#VALUE!"},{"$f":"IF(S460<='Collection System Summary_Table'!$I$8,\"Yes\",\"NO\")","v":"Yes"}]
[null,null,null,null,null,null,null,null,null,null,null,null,0,{"$error":"#VALUE!"},{"$error":"#VALUE!"},0,{"$error":"#VALUE!"},{"$error":"#VALUE!"},0,{"$error":"#VALUE!"},{"$f":"IF(S461<='Collection System Summary_Table'!$I$8,\"Yes\",\"NO\")","v":"Yes"}]
[null,null,null,null,null,null,null,null,null,null,null,null,0,{"$error":"#VALUE!"},{"$error":"#VALUE!"},0,{"$error":"#VALUE!"},{"$error":"#VALUE!"},0,{"$error":"#VALUE!"},{"$f":"IF(S462<='Collection System Summary_Table'!$I$8,\"Yes\",\"NO\")","v":"Yes"}]
[null,null,null,null,null,null,null,null,null,null,null,null,0,{"$error":"#VALUE!"},{"$error":"#VALUE!"},0,{"$error":"#VALUE!"},{"$error":"#VALUE!"},0,{"$error":"#VALUE!"},{"$f":"IF(S463<='Collection System Summary_Table'!$I$8,\"Yes\",\"NO\")","v":"Yes"}]
[null,null,null,null,null,null,null,null,null,null,null,null,0,{"$error":"#VALUE!"},{"$error":"#VALUE!"},0,{"$error":"#VALUE!"},{"$error":"#VALUE!"},0,{"$error":"#VALUE!"},{"$f":"IF(S464<='Collection System Summary_Table'!$I$8,\"Yes\",\"NO\")","v":"Yes"}]
[null,null,null,null,null,null,null,null,null,null,null,null,0,{"$error":"#VALUE!"},{"$error":"#VALUE!"},0,{"$error":"#VALUE!"},{"$error":"#VALUE!"},0,{"$error":"#VALUE!"},{"$f":"IF(S465<='Collection System Summary_Table'!$I$8,\"Yes\",\"NO\")","v":"Yes"}]
[null,null,null,null,null,null,null,null,null,null,null,null,0,{"$error":"#VALUE!"},{"$error":"#VALUE!"},0,{"$error":"#VALUE!"},{"$error":"#VALUE!"},0,{"$error":"#VALUE!"},{"$f":"IF(S466<='Collection System Summary_Table'!$I$8,\"Yes\",\"NO\")","v":"Yes"}]
[null,null,null,null,null,null,null,null,null,null,null,null,0,{"$error":"#VALUE!"},{"$error":"#VALUE!"},0,{"$error":"#VALUE!"},{"$error":"#VALUE!"},0,{"$error":"#VALUE!"},{"$f":"IF(S467<='Collection System Summary_Table'!$I$8,\"Yes\",\"NO\")","v":"Yes"}]
[null,null,null,null,null,null,null,null,null,null,null,null,0,{"$error":"#VALUE!"},{"$error":"#VALUE!"},0,{"$error":"#VALUE!"},{"$error":"#VALUE!"},0,{"$error":"#VALUE!"},{"$f":"IF(S468<='Collection System Summary_Table'!$I$8,\"Yes\",\"NO\")","v":"Yes"}]
[null,null,null,null,null,null,null,null,null,null,null,null,0,{"$error":"#VALUE!"},{"$error":"#VALUE!"},0,{"$error":"#VALUE!"},{"$error":"#VALUE!"},0,{"$error":"#VALUE!"},{"$f":"IF(S469<='Collection System Summary_Table'!$I$8,\"Yes\",\"NO\")","v":"Yes"}]
[null,null,null,null,null,null,null,null,null,null,null,null,0,{"$error":"#VALUE!"},{"$error":"#VALUE!"},0,{"$error":"#VALUE!"},{"$error":"#VALUE!"},0,{"$error":"#VALUE!"},{"$f":"IF(S470<='Collection System Summary_Table'!$I$8,\"Yes\",\"NO\")","v":"Yes"}]
[null,null,null,null,null,null,null,null,null,null,null,null,0,{"$error":"#VALUE!"},{"$error":"#VALUE!"},0,{"$error":"#VALUE!"},{"$error":"#VALUE!"},0,{"$error":"#VALUE!"},{"$f":"IF(S471<='Collection System Summary_Table'!$I$8,\"Yes\",\"NO\")","v":"Yes"}]
[null,null,null,null,null,null,null,null,null,null,null,null,0,{"$error":"#VALUE!"},{"$error":"#VALUE!"},0,{"$error":"#VALUE!"},{"$error":"#VALUE!"},0,{"$error":"#VALUE!"},{"$f":"IF(S472<='Collection System Summary_Table'!$I$8,\"Yes\",\"NO\")","v":"Yes"}]
[null,null,null,null,null,null,null,null,null,null,null,null,0,{"$error":"#VALUE!"},{"$error":"#VALUE!"},0,{"$error":"#VALUE!"},{"$error":"#VALUE!"},0,{"$error":"#VALUE!"},{"$f":"IF(S473<='Collection System Summary_Table'!$I$8,\"Yes\",\"NO\")","v":"Yes"}]
[null,null,null,null,null,null,null,null,null,null,null,null,0,{"$error":"#VALUE!"},{"$error":"#VALUE!"},0,{"$error":"#VALUE!"},{"$error":"#VALUE!"},0,{"$error":"#VALUE!"},{"$f":"IF(S474<='Collection System Summary_Table'!$I$8,\"Yes\",\"NO\")","v":"Yes"}]
[null,null,null,null,null,null,null,null,null,null,null,null,0,{"$error":"#VALUE!"},{"$error":"#VALUE!"},0,{"$error":"#VALUE!"},{"$error":"#VALUE!"},0,{"$error":"#VALUE!"},{"$f":"IF(S475<='Collection System Summary_Table'!$I$8,\"Yes\",\"NO\")","v":"Yes"}]
[null,null,null,null,null,null,null,null,null,null,null,null,0,{"$error":"#VALUE!"},{"$error":"#VALUE!"},0,{"$error":"#VALUE!"},{"$error":"#VALUE!"},0,{"$error":"#VALUE!"},{"$f":"IF(S476<='Collection System Summary_Table'!$I$8,\"Yes\",\"NO\")","v":"Yes"}]
[null,null,null,null,null,null,null,null,null,null,null,null,0,{"$error":"#VALUE!"},{"$error":"#VALUE!"},0,{"$error":"#VALUE!"},{"$error":"#VALUE!"},0,{"$error":"#VALUE!"},{"$f":"IF(S477<='Collection System Summary_Table'!$I$8,\"Yes\",\"NO\")","v":"Yes"}]
[null,null,null,null,null,null,null,null,null,null,null,null,0,{"$error":"#VALUE!"},{"$error":"#VALUE!"},0,{"$error":"#VALUE!"},{"$error":"#VALUE!"},0,{"$error":"#VALUE!"},{"$f":"IF(S478<='Collection System Summary_Table'!$I$8,\"Yes\",\"NO\")","v":"Yes"}]
[null,null,null,null,null,null,null,null,null,null,null,null,0,{"$error":"#VALUE!"},{"$error":"#VALUE!"},0,{"$error":"#VALUE!"},{"$error":"#VALUE!"},0,{"$error":"#VALUE!"},{"$f":"IF(S479<='Collection System Summary_Table'!$I$8,\"Yes\",\"NO\")","v":"Yes"}]
[null,null,null,null,null,null,null,null,null,null,null,null,0,{"$error":"#VALUE!"},{"$error":"#VALUE!"},0,{"$error":"#VALUE!"},{"$error":"#VALUE!"},0,{"$error":"#VALUE!"},{"$f":"IF(S480<='Collection System Summary_Table'!$I$8,\"Yes\",\"NO\")","v":"Yes"}]
[null,null,null,null,null,null,null,null,null,null,null,null,0,{"$error":"#VALUE!"},{"$error":"#VALUE!"},0,{"$error":"#VALUE!"},{"$error":"#VALUE!"},0,{"$error":"#VALUE!"},{"$f":"IF(S481<='Collection System Summary_Table'!$I$8,\"Yes\",\"NO\")","v":"Yes"}]
[null,null,null,null,null,null,null,null,null,null,null,null,0,{"$error":"#VALUE!"},{"$error":"#VALUE!"},0,{"$error":"#VALUE!"},{"$error":"#VALUE!"},0,{"$error":"#VALUE!"},{"$f":"IF(S482<='Collection System Summary_Table'!$I$8,\"Yes\",\"NO\")","v":"Yes"}]
[null,null,null,null,null,null,null,null,null,null,null,null,0,{"$error":"#VALUE!"},{"$error":"#VALUE!"},0,{"$error":"#VALUE!"},{"$error":"#VALUE!"},0,{"$error":"#VALUE!"},{"$f":"IF(S483<='Collection System Summary_Table'!$I$8,\"Yes\",\"NO\")","v":"Yes"}]
[null,null,null,null,null,null,null,null,null,null,null,null,0,{"$error":"#VALUE!"},{"$error":"#VALUE!"},0,{"$error":"#VALUE!"},{"$error":"#VALUE!"},0,{"$error":"#VALUE!"},{"$f":"IF(S484<='Collection System Summary_Table'!$I$8,\"Yes\",\"NO\")","v":"Yes"}]
[null,null,null,null,null,null,null,null,null,null,null,null,0,{"$error":"#VALUE!"},{"$error":"#VALUE!"},0,{"$error":"#VALUE!"},{"$error":"#VALUE!"},0,{"$error":"#VALUE!"},{"$f":"IF(S485<='Collection System Summary_Table'!$I$8,\"Yes\",\"NO\")","v":"Yes"}]
[null,null,null,null,null,null,null,null,null,null,null,null,0,{"$error":"#VALUE!"},{"$error":"#VALUE!"},0,{"$error":"#VALUE!"},{"$error":"#VALUE!"},0,{"$error":"#VALUE!"},{"$f":"IF(S486<='Collection System Summary_Table'!$I$8,\"Yes\",\"NO\")","v":"Yes"}]
[null,null,null,null,null,null,null,null,null,null,null,null,0,{"$error":"#VALUE!"},{"$error":"#VALUE!"},0,{"$error":"#VALUE!"},{"$error":"#VALUE!"},0,{"$error":"#VALUE!"},{"$f":"IF(S487<='Collection System Summary_Table'!$I$8,\"Yes\",\"NO\")","v":"Yes"}]
[null,null,null,null,null,null,null,null,null,null,null,null,0,{"$error":"#VALUE!"},{"$error":"#VALUE!"},0,{"$error":"#VALUE!"},{"$error":"#VALUE!"},0,{"$error":"#VALUE!"},{"$f":"IF(S488<='Collection System Summary_Table'!$I$8,\"Yes\",\"NO\")","v":"Yes"}]
[null,null,null,null,null,null,null,null,null,null,null,null,0,{"$error":"#VALUE!"},{"$error":"#VALUE!"},0,{"$error":"#VALUE!"},{"$error":"#VALUE!"},0,{"$error":"#VALUE!"},{"$f":"IF(S489<='Collection System Summary_Table'!$I$8,\"Yes\",\"NO\")","v":"Yes"}]
[null,null,null,null,null,null,null,null,null,null,null,null,0,{"$error":"#VALUE!"},{"$error":"#VALUE!"},0,{"$error":"#VALUE!"},{"$error":"#VALUE!"},0,{"$error":"#VALUE!"},{"$f":"IF(S490<='Collection System Summary_Table'!$I$8,\"Yes\",\"NO\")","v":"Yes"}]
[null,null,null,null,null,null,null,null,null,null,null,null,0,{"$error":"#VALUE!"},{"$error":"#VALUE!"},0,{"$error":"#VALUE!"},{"$error":"#VALUE!"},0,{"$error":"#VALUE!"},{"$f":"IF(S491<='Collection System Summary_Table'!$I$8,\"Yes\",\"NO\")","v":"Yes"}]
[null,null,null,null,null,null,null,null,null,null,null,null,0,{"$error":"#VALUE!"},{"$error":"#VALUE!"},0,{"$error":"#VALUE!"},{"$error":"#VALUE!"},0,{"$error":"#VALUE!"},{"$f":"IF(S492<='Collection System Summary_Table'!$I$8,\"Yes\",\"NO\")","v":"Yes"}]
[null,null,null,null,null,null,null,null,null,null,null,null,0,{"$error":"#VALUE!"},{"$error":"#VALUE!"},0,{"$error":"#VALUE!"},{"$error":"#VALUE!"},0,{"$error":"#VALUE!"},{"$f":"IF(S493<='Collection System Summary_Table'!$I$8,\"Yes\",\"NO\")","v":"Yes"}]
[null,null,null,null,null,null,null,null,null,null,null,null,0,{"$error":"#VALUE!"},{"$error":"#VALUE!"},0,{"$error":"#VALUE!"},{"$error":"#VALUE!"},0,{"$error":"#VALUE!"},{"$f":"IF(S494<='Collection System Summary_Table'!$I$8,\"Yes\",\"NO\")","v":"Yes"}]
[null,null,null,null,null,null,null,null,null,null,null,null,0,{"$error":"#VALUE!"},{"$error":"#VALUE!"},0,{"$error":"#VALUE!"},{"$error":"#VALUE!"},0,{"$error":"#VALUE!"},{"$f":"IF(S495<='Collection System Summary_Table'!$I$8,\"Yes\",\"NO\")","v":"Yes"}]
[null,null,null,null,null,null,null,null,null,null,null,null,0,{"$error":"#VALUE!"},{"$error":"#VALUE!"},0,{"$error":"#VALUE!"},{"$error":"#VALUE!"},0,{"$error":"#VALUE!"},{"$f":"IF(S496<='Collection System Summary_Table'!$I$8,\"Yes\",\"NO\")","v":"Yes"}]
[null,null,null,null,null,null,null,null,null,null,null,null,0,{"$error":"#VALUE!"},{"$error":"#VALUE!"},0,{"$error":"#VALUE!"},{"$error":"#VALUE!"},0,{"$error":"#VALUE!"},{"$f":"IF(S497<='Collection System Summary_Table'!$I$8,\"Yes\",\"NO\")","v":"Yes"}]
[null,null,null,null,null,null,null,null,null,null,null,null,0,{"$error":"#VALUE!"},{"$error":"#VALUE!"},0,{"$error":"#VALUE!"},{"$error":"#VALUE!"},0,{"$error":"#VALUE!"},{"$f":"IF(S498<='Collection System Summary_Table'!$I$8,\"Yes\",\"NO\")","v":"Yes"}]
[null,null,null,null,null,null,null,null,null,null,null,null,0,{"$error":"#VALUE!"},{"$error":"#VALUE!"},0,{"$error":"#VALUE!"},{"$error":"#VALUE!"},0,{"$error":"#VALUE!"},{"$f":"IF(S499<='Collection System Summary_Table'!$I$8,\"Yes\",\"NO\")","v":"Yes"}]
[null,null,null,null,null,null,null,null,null,null,null,null,0,{"$error":"#VALUE!"},{"$error":"#VALUE!"},0,{"$error":"#VALUE!"},{"$error":"#VALUE!"},0,{"$error":"#VALUE!"},{"$f":"IF(S500<='Collection System Summary_Table'!$I$8,\"Yes\",\"NO\")","v":"Yes"}]
[null,null,null,null,null,null,null,null,null,null,null,null,0,{"$error":"#VALUE!"},{"$error":"#VALUE!"},0,{"$error":"#VALUE!"},{"$error":"#VALUE!"},0,{"$error":"#VALUE!"},{"$f":"IF(S501<='Collection System Summary_Table'!$I$8,\"Yes\",\"NO\")","v":"Yes"}]
[null,null,null,null,null,null,null,null,null,null,null,null,0,{"$error":"#VALUE!"},{"$error":"#VALUE!"},0,{"$error":"#VALUE!"},{"$error":"#VALUE!"},0,{"$error":"#VALUE!"},{"$f":"IF(S502<='Collection System Summary_Table'!$I$8,\"Yes\",\"NO\")","v":"Yes"}]
[null,null,null,null,null,null,null,null,null,null,null,null,0,{"$error":"#VALUE!"},{"$error":"#VALUE!"},0,{"$error":"#VALUE!"},{"$error":"#VALUE!"},0,{"$error":"#VALUE!"},{"$f":"IF(S503<='Collection System Summary_Table'!$I$8,\"Yes\",\"NO\")","v":"Yes"}]
[null,null,null,null,null,null,null,null,null,null,null,null,0,{"$error":"#VALUE!"},{"$error":"#VALUE!"},0,{"$error":"#VALUE!"},{"$error":"#VALUE!"},0,{"$error":"#VALUE!"},{"$f":"IF(S504<='Collection System Summary_Table'!$I$8,\"Yes\",\"NO\")","v":"Yes"}]
[null,null,null,null,null,null,null,null,null,null,null,null,0,{"$error":"#VALUE!"},{"$error":"#VALUE!"},0,{"$error":"#VALUE!"},{"$error":"#VALUE!"},0,{"$error":"#VALUE!"},{"$f":"IF(S505<='Collection System Summary_Table'!$I$8,\"Yes\",\"NO\")","v":"Yes"}]
[null,null,null,null,null,null,null,null,null,null,null,null,0,{"$error":"#VALUE!"},{"$error":"#VALUE!"},0,{"$error":"#VALUE!"},{"$error":"#VALUE!"},0,{"$error":"#VALUE!"},{"$f":"IF(S506<='Collection System Summary_Table'!$I$8,\"Yes\",\"NO\")","v":"Yes"}]
[null,null,null,null,null,null,null,null,null,null,null,null,0,{"$error":"#VALUE!"},{"$error":"#VALUE!"},0,{"$error":"#VALUE!"},{"$error":"#VALUE!"},0,{"$error":"#VALUE!"},{"$f":"IF(S507<='Collection System Summary_Table'!$I$8,\"Yes\",\"NO\")","v":"Yes"}]
[null,null,null,null,null,null,null,null,null,null,null,null,0,{"$error":"#VALUE!"},{"$error":"#VALUE!"},0,{"$error":"#VALUE!"},{"$error":"#VALUE!"},0,{"$error":"#VALUE!"},{"$f":"IF(S508<='Collection System Summary_Table'!$I$8,\"Yes\",\"NO\")","v":"Yes"}]
[null,null,null,null,null,null,null,null,null,null,null,null,0,{"$error":"#VALUE!"},{"$error":"#VALUE!"},0,{"$error":"#VALUE!"},{"$error":"#VALUE!"},0,{"$error":"#VALUE!"},{"$f":"IF(S509<='Collection System Summary_Table'!$I$8,\"Yes\",\"NO\")","v":"Yes"}]
[null,null,null,null,null,null,null,null,null,null,null,null,0,{"$error":"#VALUE!"},{"$error":"#VALUE!"},0,{"$error":"#VALUE!"},{"$error":"#VALUE!"},0,{"$error":"#VALUE!"},{"$f":"IF(S510<='Collection System Summary_Table'!$I$8,\"Yes\",\"NO\")","v":"Yes"}]
[null,null,null,null,null,null,null,null,null,null,null,null,0,{"$error":"#VALUE!"},{"$error":"#VALUE!"},0,{"$error":"#VALUE!"},{"$error":"#VALUE!"},0,{"$error":"#VALUE!"},{"$f":"IF(S511<='Collection System Summary_Table'!$I$8,\"Yes\",\"NO\")","v":"Yes"}]
[null,null,null,null,null,null,null,null,null,null,null,null,0,{"$error":"#VALUE!"},{"$error":"#VALUE!"},0,{"$error":"#VALUE!"},{"$error":"#VALUE!"},0,{"$error":"#VALUE!"},{"$f":"IF(S512<='Collection System Summary_Table'!$I$8,\"Yes\",\"NO\")","v":"Yes"}]
[null,null,null,null,null,null,null,null,null,null,null,null,0,{"$error":"#VALUE!"},{"$error":"#VALUE!"},0,{"$error":"#VALUE!"},{"$error":"#VALUE!"},0,{"$error":"#VALUE!"},{"$f":"IF(S513<='Collection System Summary_Table'!$I$8,\"Yes\",\"NO\")","v":"Yes"}]
[null,null,null,null,null,null,null,null,null,null,null,null,0,{"$error":"#VALUE!"},{"$error":"#VALUE!"},0,{"$error":"#VALUE!"},{"$error":"#VALUE!"},0,{"$error":"#VALUE!"},{"$f":"IF(S514<='Collection System Summary_Table'!$I$8,\"Yes\",\"NO\")","v":"Yes"}]
[null,null,null,null,null,null,null,null,null,null,null,null,0,{"$f":"IF(P515=0,I515+N514,0)","v":{"$error":"#VALUE!"}},{"$error":"#VALUE!"},0,{"$error":"#VALUE!"},{"$error":"#VALUE!"},0,{"$error":"#VALUE!"},{"$f":"IF(S515<='Collection System Summary_Table'!$I$8,\"Yes\",\"NO\")","v":"Yes"}]
[null,null,null,null,null,null,null,null,null,null,null,null,0,{"$error":"#VALUE!"},{"$f":"IF(AND(Q516=0,P516=0),K516+O515,0)","v":{"$error":"#VALUE!"}},0,{"$f":"IF(AND(P516=0,N516<($B$4+$P$1)),J516,0)","v":{"$error":"#VALUE!"}},{"$f":"IF(AND(P516=0,Q516=0,O516<($B$5+$Q$1)),K516,0)","v":{"$error":"#VALUE!"}},{"$f":"S515+L516","v":0},{"$f":"IF(OR(P516>1,Q516>1,R516>1),\"YES\",\"NO\")","v":{"$error":"#VALUE!"}},{"$f":"IF(S516<='Collection System Summary_Table'!$I$8,\"Yes\",\"NO\")","v":"Yes"}]
[null,null,null,null,null,null,null,null,null,null,null,null,{"$f":"M516+I517","v":0},{"$error":"#VALUE!"},{"$error":"#VALUE!"},{"$f":"IF(M517<=$B$3,I517,0)","v":0},{"$error":"#VALUE!"},{"$error":"#VALUE!"},0,{"$error":"#VALUE!"},{"$f":"IF(S517<='Collection System Summary_Table'!$I$8,\"Yes\",\"NO\")","v":"Yes"}]
[null,null,null,null,null,null,null,null,null,null,null,null,0,{"$error":"#VALUE!"},{"$error":"#VALUE!"},0,{"$error":"#VALUE!"},{"$error":"#VALUE!"},0,{"$error":"#VALUE!"},{"$f":"IF(S518<='Collection System Summary_Table'!$I$8,\"Yes\",\"NO\")","v":"Yes"}]
[null,null,null,null,null,null,null,null,null,null,null,null,0,{"$error":"#VALUE!"},{"$error":"#VALUE!"},0,{"$error":"#VALUE!"},{"$error":"#VALUE!"},0,{"$error":"#VALUE!"},{"$f":"IF(S519<='Collection System Summary_Table'!$I$8,\"Yes\",\"NO\")","v":"Yes"}]
[null,null,null,null,null,null,null,null,null,null,null,null,0,{"$error":"#VALUE!"},{"$error":"#VALUE!"},0,{"$error":"#VALUE!"},{"$error":"#VALUE!"},0,{"$error":"#VALUE!"},{"$f":"IF(S520<='Collection System Summary_Table'!$I$8,\"Yes\",\"NO\")","v":"Yes"}]
[null,null,null,null,null,null,null,null,null,null,null,null,0,{"$error":"#VALUE!"},{"$error":"#VALUE!"},0,{"$error":"#VALUE!"},{"$error":"#VALUE!"},0,{"$error":"#VALUE!"},{"$f":"IF(S521<='Collection System Summary_Table'!$I$8,\"Yes\",\"NO\")","v":"Yes"}]
[null,null,null,null,null,null,null,null,null,null,null,null,0,{"$error":"#VALUE!"},{"$error":"#VALUE!"},0,{"$error":"#VALUE!"},{"$error":"#VALUE!"},0,{"$error":"#VALUE!"},{"$f":"IF(S522<='Collection System Summary_Table'!$I$8,\"Yes\",\"NO\")","v":"Yes"}]
[null,null,null,null,null,null,null,null,null,null,null,null,0,{"$error":"#VALUE!"},{"$error":"#VALUE!"},0,{"$error":"#VALUE!"},{"$error":"#VALUE!"},0,{"$error":"#VALUE!"},{"$f":"IF(S523<='Collection System Summary_Table'!$I$8,\"Yes\",\"NO\")","v":"Yes"}]
[null,null,null,null,null,null,null,null,null,null,null,null,0,{"$error":"#VALUE!"},{"$error":"#VALUE!"},0,{"$error":"#VALUE!"},{"$error":"#VALUE!"},0,{"$error":"#VALUE!"},{"$f":"IF(S524<='Collection System Summary_Table'!$I$8,\"Yes\",\"NO\")","v":"Yes"}]
[null,null,null,null,null,null,null,null,null,null,null,null,0,{"$error":"#VALUE!"},{"$error":"#VALUE!"},0,{"$error":"#VALUE!"},{"$error":"#VALUE!"},0,{"$error":"#VALUE!"},{"$f":"IF(S525<='Collection System Summary_Table'!$I$8,\"Yes\",\"NO\")","v":"Yes"}]
[null,null,null,null,null,null,null,null,null,null,null,null,0,{"$error":"#VALUE!"},{"$error":"#VALUE!"},0,{"$error":"#VALUE!"},{"$error":"#VALUE!"},0,{"$error":"#VALUE!"},{"$f":"IF(S526<='Collection System Summary_Table'!$I$8,\"Yes\",\"NO\")","v":"Yes"}]
[null,null,null,null,null,null,null,null,null,null,null,null,0,{"$error":"#VALUE!"},{"$error":"#VALUE!"},0,{"$error":"#VALUE!"},{"$error":"#VALUE!"},0,{"$error":"#VALUE!"},{"$f":"IF(S527<='Collection System Summary_Table'!$I$8,\"Yes\",\"NO\")","v":"Yes"}]
[null,null,null,null,null,null,null,null,null,null,null,null,0,{"$error":"#VALUE!"},{"$error":"#VALUE!"},0,{"$error":"#VALUE!"},{"$error":"#VALUE!"},0,{"$error":"#VALUE!"},{"$f":"IF(S528<='Collection System Summary_Table'!$I$8,\"Yes\",\"NO\")","v":"Yes"}]
[null,null,null,null,null,null,null,null,null,null,null,null,0,{"$error":"#VALUE!"},{"$error":"#VALUE!"},0,{"$error":"#VALUE!"},{"$error":"#VALUE!"},0,{"$error":"#VALUE!"},{"$f":"IF(S529<='Collection System Summary_Table'!$I$8,\"Yes\",\"NO\")","v":"Yes"}]
[null,null,null,null,null,null,null,null,null,null,null,null,0,{"$error":"#VALUE!"},{"$error":"#VALUE!"},0,{"$error":"#VALUE!"},{"$error":"#VALUE!"},0,{"$error":"#VALUE!"},{"$f":"IF(S530<='Collection System Summary_Table'!$I$8,\"Yes\",\"NO\")","v":"Yes"}]
[null,null,null,null,null,null,null,null,null,null,null,null,0,{"$error":"#VALUE!"},{"$error":"#VALUE!"},0,{"$error":"#VALUE!"},{"$error":"#VALUE!"},0,{"$error":"#VALUE!"},{"$f":"IF(S531<='Collection System Summary_Table'!$I$8,\"Yes\",\"NO\")","v":"Yes"}]
[null,null,null,null,null,null,null,null,null,null,null,null,0,{"$error":"#VALUE!"},{"$error":"#VALUE!"},0,{"$error":"#VALUE!"},{"$error":"#VALUE!"},0,{"$error":"#VALUE!"},{"$f":"IF(S532<='Collection System Summary_Table'!$I$8,\"Yes\",\"NO\")","v":"Yes"}]
[null,null,null,null,null,null,null,null,null,null,null,null,0,{"$error":"#VALUE!"},{"$error":"#VALUE!"},0,{"$error":"#VALUE!"},{"$error":"#VALUE!"},0,{"$error":"#VALUE!"},{"$f":"IF(S533<='Collection System Summary_Table'!$I$8,\"Yes\",\"NO\")","v":"Yes"}]
[null,null,null,null,null,null,null,null,null,null,null,null,0,{"$error":"#VALUE!"},{"$error":"#VALUE!"},0,{"$error":"#VALUE!"},{"$error":"#VALUE!"},0,{"$error":"#VALUE!"},{"$f":"IF(S534<='Collection System Summary_Table'!$I$8,\"Yes\",\"NO\")","v":"Yes"}]
[null,null,null,null,null,null,null,null,null,null,null,null,0,{"$error":"#VALUE!"},{"$error":"#VALUE!"},0,{"$error":"#VALUE!"},{"$error":"#VALUE!"},0,{"$error":"#VALUE!"},{"$f":"IF(S535<='Collection System Summary_Table'!$I$8,\"Yes\",\"NO\")","v":"Yes"}]
[null,null,null,null,null,null,null,null,null,null,null,null,0,{"$error":"#VALUE!"},{"$error":"#VALUE!"},0,{"$error":"#VALUE!"},{"$error":"#VALUE!"},0,{"$error":"#VALUE!"},{"$f":"IF(S536<='Collection System Summary_Table'!$I$8,\"Yes\",\"NO\")","v":"Yes"}]
[null,null,null,null,null,null,null,null,null,null,null,null,0,{"$error":"#VALUE!"},{"$error":"#VALUE!"},0,{"$error":"#VALUE!"},{"$error":"#VALUE!"},0,{"$error":"#VALUE!"},{"$f":"IF(S537<='Collection System Summary_Table'!$I$8,\"Yes\",\"NO\")","v":"Yes"}]
[null,null,null,null,null,null,null,null,null,null,null,null,0,{"$error":"#VALUE!"},{"$error":"#VALUE!"},0,{"$error":"#VALUE!"},{"$error":"#VALUE!"},0,{"$error":"#VALUE!"},{"$f":"IF(S538<='Collection System Summary_Table'!$I$8,\"Yes\",\"NO\")","v":"Yes"}]
[null,null,null,null,null,null,null,null,null,null,null,null,0,{"$error":"#VALUE!"},{"$error":"#VALUE!"},0,{"$error":"#VALUE!"},{"$error":"#VALUE!"},0,{"$error":"#VALUE!"},{"$f":"IF(S539<='Collection System Summary_Table'!$I$8,\"Yes\",\"NO\")","v":"Yes"}]
[null,null,null,null,null,null,null,null,null,null,null,null,0,{"$error":"#VALUE!"},{"$error":"#VALUE!"},0,{"$error":"#VALUE!"},{"$error":"#VALUE!"},0,{"$error":"#VALUE!"},{"$f":"IF(S540<='Collection System Summary_Table'!$I$8,\"Yes\",\"NO\")","v":"Yes"}]
[null,null,null,null,null,null,null,null,null,null,null,null,0,{"$error":"#VALUE!"},{"$error":"#VALUE!"},0,{"$error":"#VALUE!"},{"$error":"#VALUE!"},0,{"$error":"#VALUE!"},{"$f":"IF(S541<='Collection System Summary_Table'!$I$8,\"Yes\",\"NO\")","v":"Yes"}]
[null,null,null,null,null,null,null,null,null,null,null,null,0,{"$error":"#VALUE!"},{"$error":"#VALUE!"},0,{"$error":"#VALUE!"},{"$error":"#VALUE!"},0,{"$error":"#VALUE!"},{"$f":"IF(S542<='Collection System Summary_Table'!$I$8,\"Yes\",\"NO\")","v":"Yes"}]
[null,null,null,null,null,null,null,null,null,null,null,null,0,{"$error":"#VALUE!"},{"$error":"#VALUE!"},0,{"$error":"#VALUE!"},{"$error":"#VALUE!"},0,{"$error":"#VALUE!"},{"$f":"IF(S543<='Collection System Summary_Table'!$I$8,\"Yes\",\"NO\")","v":"Yes"}]
[null,null,null,null,null,null,null,null,null,null,null,null,0,{"$error":"#VALUE!"},{"$error":"#VALUE!"},0,{"$error":"#VALUE!"},{"$error":"#VALUE!"},0,{"$error":"#VALUE!"},{"$f":"IF(S544<='Collection System Summary_Table'!$I$8,\"Yes\",\"NO\")","v":"Yes"}]
[null,null,null,null,null,null,null,null,null,null,null,null,0,{"$error":"#VALUE!"},{"$error":"#VALUE!"},0,{"$error":"#VALUE!"},{"$error":"#VALUE!"},0,{"$error":"#VALUE!"},{"$f":"IF(S545<='Collection System Summary_Table'!$I$8,\"Yes\",\"NO\")","v":"Yes"}]
[null,null,null,null,null,null,null,null,null,null,null,null,0,{"$error":"#VALUE!"},{"$error":"#VALUE!"},0,{"$error":"#VALUE!"},{"$error":"#VALUE!"},0,{"$error":"#VALUE!"},{"$f":"IF(S546<='Collection System Summary_Table'!$I$8,\"Yes\",\"NO\")","v":"Yes"}]
[null,null,null,null,null,null,null,null,null,null,null,null,0,{"$error":"#VALUE!"},{"$error":"#VALUE!"},0,{"$error":"#VALUE!"},{"$error":"#VALUE!"},0,{"$error":"#VALUE!"},{"$f":"IF(S547<='Collection System Summary_Table'!$I$8,\"Yes\",\"NO\")","v":"Yes"}]
[null,null,null,null,null,null,null,null,null,null,null,null,0,{"$error":"#VALUE!"},{"$error":"#VALUE!"},0,{"$error":"#VALUE!"},{"$error":"#VALUE!"},0,{"$error":"#VALUE!"},{"$f":"IF(S548<='Collection System Summary_Table'!$I$8,\"Yes\",\"NO\")","v":"Yes"}]
[null,null,null,null,null,null,null,null,null,null,null,null,0,{"$error":"#VALUE!"},{"$error":"#VALUE!"},0,{"$error":"#VALUE!"},{"$error":"#VALUE!"},0,{"$error":"#VALUE!"},{"$f":"IF(S549<='Collection System Summary_Table'!$I$8,\"Yes\",\"NO\")","v":"Yes"}]
[null,null,null,null,null,null,null,null,null,null,null,null,0,{"$error":"#VALUE!"},{"$error":"#VALUE!"},0,{"$error":"#VALUE!"},{"$error":"#VALUE!"},0,{"$error":"#VALUE!"},{"$f":"IF(S550<='Collection System Summary_Table'!$I$8,\"Yes\",\"NO\")","v":"Yes"}]
[null,null,null,null,null,null,null,null,null,null,null,null,0,{"$error":"#VALUE!"},{"$error":"#VALUE!"},0,{"$error":"#VALUE!"},{"$error":"#VALUE!"},0,{"$error":"#VALUE!"},{"$f":"IF(S551<='Collection System Summary_Table'!$I$8,\"Yes\",\"NO\")","v":"Yes"}]
[null,null,null,null,null,null,null,null,null,null,null,null,0,{"$error":"#VALUE!"},{"$error":"#VALUE!"},0,{"$error":"#VALUE!"},{"$error":"#VALUE!"},0,{"$error":"#VALUE!"},{"$f":"IF(S552<='Collection System Summary_Table'!$I$8,\"Yes\",\"NO\")","v":"Yes"}]
[null,null,null,null,null,null,null,null,null,null,null,null,0,{"$error":"#VALUE!"},{"$error":"#VALUE!"},0,{"$error":"#VALUE!"},{"$error":"#VALUE!"},0,{"$error":"#VALUE!"},{"$f":"IF(S553<='Collection System Summary_Table'!$I$8,\"Yes\",\"NO\")","v":"Yes"}]
[null,null,null,null,null,null,null,null,null,null,null,null,0,{"$error":"#VALUE!"},{"$error":"#VALUE!"},0,{"$error":"#VALUE!"},{"$error":"#VALUE!"},0,{"$error":"#VALUE!"},{"$f":"IF(S554<='Collection System Summary_Table'!$I$8,\"Yes\",\"NO\")","v":"Yes"}]
[null,null,null,null,null,null,null,null,null,null,null,null,0,{"$error":"#VALUE!"},{"$error":"#VALUE!"},0,{"$error":"#VALUE!"},{"$error":"#VALUE!"},0,{"$error":"#VALUE!"},{"$f":"IF(S555<='Collection System Summary_Table'!$I$8,\"Yes\",\"NO\")","v":"Yes"}]
[null,null,null,null,null,null,null,null,null,null,null,null,0,{"$error":"#VALUE!"},{"$error":"#VALUE!"},0,{"$error":"#VALUE!"},{"$error":"#VALUE!"},0,{"$error":"#VALUE!"},{"$f":"IF(S556<='Collection System Summary_Table'!$I$8,\"Yes\",\"NO\")","v":"Yes"}]
[null,null,null,null,null,null,null,null,null,null,null,null,0,{"$error":"#VALUE!"},{"$error":"#VALUE!"},0,{"$error":"#VALUE!"},{"$error":"#VALUE!"},0,{"$error":"#VALUE!"},{"$f":"IF(S557<='Collection System Summary_Table'!$I$8,\"Yes\",\"NO\")","v":"Yes"}]
[null,null,null,null,null,null,null,null,null,null,null,null,0,{"$error":"#VALUE!"},{"$error":"#VALUE!"},0,{"$error":"#VALUE!"},{"$error":"#VALUE!"},0,{"$error":"#VALUE!"},{"$f":"IF(S558<='Collection System Summary_Table'!$I$8,\"Yes\",\"NO\")","v":"Yes"}]
[null,null,null,null,null,null,null,null,null,null,null,null,0,{"$error":"#VALUE!"},{"$error":"#VALUE!"},0,{"$error":"#VALUE!"},{"$error":"#VALUE!"},0,{"$error":"#VALUE!"},{"$f":"IF(S559<='Collection System Summary_Table'!$I$8,\"Yes\",\"NO\")","v":"Yes"}]
[null,null,null,null,null,null,null,null,null,null,null,null,0,{"$error":"#VALUE!"},{"$error":"#VALUE!"},0,{"$error":"#VALUE!"},{"$error":"#VALUE!"},0,{"$error":"#VALUE!"},{"$f":"IF(S560<='Collection System Summary_Table'!$I$8,\"Yes\",\"NO\")","v":"Yes"}]
[null,null,null,null,null,null,null,null,null,null,null,null,0,{"$error":"#VALUE!"},{"$error":"#VALUE!"},0,{"$error":"#VALUE!"},{"$error":"#VALUE!"},0,{"$error":"#VALUE!"},{"$f":"IF(S561<='Collection System Summary_Table'!$I$8,\"Yes\",\"NO\")","v":"Yes"}]
[null,null,null,null,null,null,null,null,null,null,null,null,0,{"$error":"#VALUE!"},{"$error":"#VALUE!"},0,{"$error":"#VALUE!"},{"$error":"#VALUE!"},0,{"$error":"#VALUE!"},{"$f":"IF(S562<='Collection System Summary_Table'!$I$8,\"Yes\",\"NO\")","v":"Yes"}]
[null,null,null,null,null,null,null,null,null,null,null,null,0,{"$error":"#VALUE!"},{"$error":"#VALUE!"},0,{"$error":"#VALUE!"},{"$error":"#VALUE!"},0,{"$error":"#VALUE!"},{"$f":"IF(S563<='Collection System Summary_Table'!$I$8,\"Yes\",\"NO\")","v":"Yes"}]
[null,null,null,null,null,null,null,null,null,null,null,null,0,{"$error":"#VALUE!"},{"$error":"#VALUE!"},0,{"$error":"#VALUE!"},{"$error":"#VALUE!"},0,{"$error":"#VALUE!"},{"$f":"IF(S564<='Collection System Summary_Table'!$I$8,\"Yes\",\"NO\")","v":"Yes"}]
[null,null,null,null,null,null,null,null,null,null,null,null,0,{"$error":"#VALUE!"},{"$error":"#VALUE!"},0,{"$error":"#VALUE!"},{"$error":"#VALUE!"},0,{"$error":"#VALUE!"},{"$f":"IF(S565<='Collection System Summary_Table'!$I$8,\"Yes\",\"NO\")","v":"Yes"}]
[null,null,null,null,null,null,null,null,null,null,null,null,0,{"$error":"#VALUE!"},{"$error":"#VALUE!"},0,{"$error":"#VALUE!"},{"$error":"#VALUE!"},0,{"$error":"#VALUE!"},{"$f":"IF(S566<='Collection System Summary_Table'!$I$8,\"Yes\",\"NO\")","v":"Yes"}]
[null,null,null,null,null,null,null,null,null,null,null,null,0,{"$error":"#VALUE!"},{"$error":"#VALUE!"},0,{"$error":"#VALUE!"},{"$error":"#VALUE!"},0,{"$error":"#VALUE!"},{"$f":"IF(S567<='Collection System Summary_Table'!$I$8,\"Yes\",\"NO\")","v":"Yes"}]
[null,null,null,null,null,null,null,null,null,null,null,null,0,{"$error":"#VALUE!"},{"$error":"#VALUE!"},0,{"$error":"#VALUE!"},{"$error":"#VALUE!"},0,{"$error":"#VALUE!"},{"$f":"IF(S568<='Collection System Summary_Table'!$I$8,\"Yes\",\"NO\")","v":"Yes"}]
[null,null,null,null,null,null,null,null,null,null,null,null,0,{"$error":"#VALUE!"},{"$error":"#VALUE!"},0,{"$error":"#VALUE!"},{"$error":"#VALUE!"},0,{"$error":"#VALUE!"},{"$f":"IF(S569<='Collection System Summary_Table'!$I$8,\"Yes\",\"NO\")","v":"Yes"}]
[null,null,null,null,null,null,null,null,null,null,null,null,0,{"$error":"#VALUE!"},{"$error":"#VALUE!"},0,{"$error":"#VALUE!"},{"$error":"#VALUE!"},0,{"$error":"#VALUE!"},{"$f":"IF(S570<='Collection System Summary_Table'!$I$8,\"Yes\",\"NO\")","v":"Yes"}]
[null,null,null,null,null,null,null,null,null,null,null,null,0,{"$error":"#VALUE!"},{"$error":"#VALUE!"},0,{"$error":"#VALUE!"},{"$error":"#VALUE!"},0,{"$error":"#VALUE!"},{"$f":"IF(S571<='Collection System Summary_Table'!$I$8,\"Yes\",\"NO\")","v":"Yes"}]
[null,null,null,null,null,null,null,null,null,null,null,null,0,{"$error":"#VALUE!"},{"$error":"#VALUE!"},0,{"$error":"#VALUE!"},{"$error":"#VALUE!"},0,{"$error":"#VALUE!"},{"$f":"IF(S572<='Collection System Summary_Table'!$I$8,\"Yes\",\"NO\")","v":"Yes"}]
[null,null,null,null,null,null,null,null,null,null,null,null,0,{"$error":"#VALUE!"},{"$error":"#VALUE!"},0,{"$error":"#VALUE!"},{"$error":"#VALUE!"},0,{"$error":"#VALUE!"},{"$f":"IF(S573<='Collection System Summary_Table'!$I$8,\"Yes\",\"NO\")","v":"Yes"}]
[null,null,null,null,null,null,null,null,null,null,null,null,0,{"$error":"#VALUE!"},{"$error":"#VALUE!"},0,{"$error":"#VALUE!"},{"$error":"#VALUE!"},0,{"$error":"#VALUE!"},{"$f":"IF(S574<='Collection System Summary_Table'!$I$8,\"Yes\",\"NO\")","v":"Yes"}]
[null,null,null,null,null,null,null,null,null,null,null,null,0,{"$error":"#VALUE!"},{"$error":"#VALUE!"},0,{"$error":"#VALUE!"},{"$error":"#VALUE!"},0,{"$error":"#VALUE!"},{"$f":"IF(S575<='Collection System Summary_Table'!$I$8,\"Yes\",\"NO\")","v":"Yes"}]
[null,null,null,null,null,null,null,null,null,null,null,null,0,{"$error":"#VALUE!"},{"$error":"#VALUE!"},0,{"$error":"#VALUE!"},{"$error":"#VALUE!"},0,{"$error":"#VALUE!"},{"$f":"IF(S576<='Collection System Summary_Table'!$I$8,\"Yes\",\"NO\")","v":"Yes"}]
[null,null,null,null,null,null,null,null,null,null,null,null,0,{"$error":"#VALUE!"},{"$error":"#VALUE!"},0,{"$error":"#VALUE!"},{"$error":"#VALUE!"},0,{"$error":"#VALUE!"},{"$f":"IF(S577<='Collection System Summary_Table'!$I$8,\"Yes\",\"NO\")","v":"Yes"}]
[null,null,null,null,null,null,null,null,null,null,null,null,0,{"$error":"#VALUE!"},{"$error":"#VALUE!"},0,{"$error":"#VALUE!"},{"$error":"#VALUE!"},0,{"$error":"#VALUE!"},{"$f":"IF(S578<='Collection System Summary_Table'!$I$8,\"Yes\",\"NO\")","v":"Yes"}]
[null,null,null,null,null,null,null,null,null,null,null,null,0,{"$f":"IF(P579=0,I579+N578,0)","v":{"$error":"#VALUE!"}},{"$error":"#VALUE!"},0,{"$error":"#VALUE!"},{"$error":"#VALUE!"},0,{"$error":"#VALUE!"},{"$f":"IF(S579<='Collection System Summary_Table'!$I$8,\"Yes\",\"NO\")","v":"Yes"}]
[null,null,null,null,null,null,null,null,null,null,null,null,0,{"$error":"#VALUE!"},{"$f":"IF(AND(Q580=0,P580=0),K580+O579,0)","v":{"$error":"#VALUE!"}},0,{"$f":"IF(AND(P580=0,N580<($B$4+$P$1)),J580,0)","v":{"$error":"#VALUE!"}},{"$f":"IF(AND(P580=0,Q580=0,O580<($B$5+$Q$1)),K580,0)","v":{"$error":"#VALUE!"}},{"$f":"S579+L580","v":0},{"$f":"IF(OR(P580>1,Q580>1,R580>1),\"YES\",\"NO\")","v":{"$error":"#VALUE!"}},{"$f":"IF(S580<='Collection System Summary_Table'!$I$8,\"Yes\",\"NO\")","v":"Yes"}]
[null,null,null,null,null,null,null,null,null,null,null,null,{"$f":"M580+I581","v":0},{"$error":"#VALUE!"},{"$error":"#VALUE!"},{"$f":"IF(M581<=$B$3,I581,0)","v":0},{"$error":"#VALUE!"},{"$error":"#VALUE!"},0,{"$error":"#VALUE!"},{"$f":"IF(S581<='Collection System Summary_Table'!$I$8,\"Yes\",\"NO\")","v":"Yes"}]
[null,null,null,null,null,null,null,null,null,null,null,null,0,{"$error":"#VALUE!"},{"$error":"#VALUE!"},0,{"$error":"#VALUE!"},{"$error":"#VALUE!"},0,{"$error":"#VALUE!"},{"$f":"IF(S582<='Collection System Summary_Table'!$I$8,\"Yes\",\"NO\")","v":"Yes"}]
[null,null,null,null,null,null,null,null,null,null,null,null,0,{"$error":"#VALUE!"},{"$error":"#VALUE!"},0,{"$error":"#VALUE!"},{"$error":"#VALUE!"},0,{"$error":"#VALUE!"},{"$f":"IF(S583<='Collection System Summary_Table'!$I$8,\"Yes\",\"NO\")","v":"Yes"}]
[null,null,null,null,null,null,null,null,null,null,null,null,0,{"$error":"#VALUE!"},{"$error":"#VALUE!"},0,{"$error":"#VALUE!"},{"$error":"#VALUE!"},0,{"$error":"#VALUE!"},{"$f":"IF(S584<='Collection System Summary_Table'!$I$8,\"Yes\",\"NO\")","v":"Yes"}]
[null,null,null,null,null,null,null,null,null,null,null,null,0,{"$error":"#VALUE!"},{"$error":"#VALUE!"},0,{"$error":"#VALUE!"},{"$error":"#VALUE!"},0,{"$error":"#VALUE!"},{"$f":"IF(S585<='Collection System Summary_Table'!$I$8,\"Yes\",\"NO\")","v":"Yes"}]
[null,null,null,null,null,null,null,null,null,null,null,null,0,{"$error":"#VALUE!"},{"$error":"#VALUE!"},0,{"$error":"#VALUE!"},{"$error":"#VALUE!"},0,{"$error":"#VALUE!"},{"$f":"IF(S586<='Collection System Summary_Table'!$I$8,\"Yes\",\"NO\")","v":"Yes"}]
[null,null,null,null,null,null,null,null,null,null,null,null,0,{"$error":"#VALUE!"},{"$error":"#VALUE!"},0,{"$error":"#VALUE!"},{"$error":"#VALUE!"},0,{"$error":"#VALUE!"},{"$f":"IF(S587<='Collection System Summary_Table'!$I$8,\"Yes\",\"NO\")","v":"Yes"}]
[null,null,null,null,null,null,null,null,null,null,null,null,0,{"$error":"#VALUE!"},{"$error":"#VALUE!"},0,{"$error":"#VALUE!"},{"$error":"#VALUE!"},0,{"$error":"#VALUE!"},{"$f":"IF(S588<='Collection System Summary_Table'!$I$8,\"Yes\",\"NO\")","v":"Yes"}]
[null,null,null,null,null,null,null,null,null,null,null,null,0,{"$error":"#VALUE!"},{"$error":"#VALUE!"},0,{"$error":"#VALUE!"},{"$error":"#VALUE!"},0,{"$error":"#VALUE!"},{"$f":"IF(S589<='Collection System Summary_Table'!$I$8,\"Yes\",\"NO\")","v":"Yes"}]
[null,null,null,null,null,null,null,null,null,null,null,null,0,{"$error":"#VALUE!"},{"$error":"#VALUE!"},0,{"$error":"#VALUE!"},{"$error":"#VALUE!"},0,{"$error":"#VALUE!"},{"$f":"IF(S590<='Collection System Summary_Table'!$I$8,\"Yes\",\"NO\")","v":"Yes"}]
[null,null,null,null,null,null,null,null,null,null,null,null,0,{"$error":"#VALUE!"},{"$error":"#VALUE!"},0,{"$error":"#VALUE!"},{"$error":"#VALUE!"},0,{"$error":"#VALUE!"},{"$f":"IF(S591<='Collection System Summary_Table'!$I$8,\"Yes\",\"NO\")","v":"Yes"}]
[null,null,null,null,null,null,null,null,null,null,null,null,0,{"$error":"#VALUE!"},{"$error":"#VALUE!"},0,{"$error":"#VALUE!"},{"$error":"#VALUE!"},0,{"$error":"#VALUE!"},{"$f":"IF(S592<='Collection System Summary_Table'!$I$8,\"Yes\",\"NO\")","v":"Yes"}]
[null,null,null,null,null,null,null,null,null,null,null,null,0,{"$error":"#VALUE!"},{"$error":"#VALUE!"},0,{"$error":"#VALUE!"},{"$error":"#VALUE!"},0,{"$error":"#VALUE!"},{"$f":"IF(S593<='Collection System Summary_Table'!$I$8,\"Yes\",\"NO\")","v":"Yes"}]
[null,null,null,null,null,null,null,null,null,null,null,null,0,{"$error":"#VALUE!"},{"$error":"#VALUE!"},0,{"$error":"#VALUE!"},{"$error":"#VALUE!"},0,{"$error":"#VALUE!"},{"$f":"IF(S594<='Collection System Summary_Table'!$I$8,\"Yes\",\"NO\")","v":"Yes"}]
[null,null,null,null,null,null,null,null,null,null,null,null,0,{"$error":"#VALUE!"},{"$error":"#VALUE!"},0,{"$error":"#VALUE!"},{"$error":"#VALUE!"},0,{"$error":"#VALUE!"},{"$f":"IF(S595<='Collection System Summary_Table'!$I$8,\"Yes\",\"NO\")","v":"Yes"}]
[null,null,null,null,null,null,null,null,null,null,null,null,0,{"$error":"#VALUE!"},{"$error":"#VALUE!"},0,{"$error":"#VALUE!"},{"$error":"#VALUE!"},0,{"$error":"#VALUE!"},{"$f":"IF(S596<='Collection System Summary_Table'!$I$8,\"Yes\",\"NO\")","v":"Yes"}]
[null,null,null,null,null,null,null,null,null,null,null,null,0,{"$error":"#VALUE!"},{"$error":"#VALUE!"},0,{"$error":"#VALUE!"},{"$error":"#VALUE!"},0,{"$error":"#VALUE!"},{"$f":"IF(S597<='Collection System Summary_Table'!$I$8,\"Yes\",\"NO\")","v":"Yes"}]
[null,null,null,null,null,null,null,null,null,null,null,null,0,{"$error":"#VALUE!"},{"$error":"#VALUE!"},0,{"$error":"#VALUE!"},{"$error":"#VALUE!"},0,{"$error":"#VALUE!"},{"$f":"IF(S598<='Collection System Summary_Table'!$I$8,\"Yes\",\"NO\")","v":"Yes"}]
[null,null,null,null,null,null,null,null,null,null,null,null,0,{"$error":"#VALUE!"},{"$error":"#VALUE!"},0,{"$error":"#VALUE!"},{"$error":"#VALUE!"},0,{"$error":"#VALUE!"},{"$f":"IF(S599<='Collection System Summary_Table'!$I$8,\"Yes\",\"NO\")","v":"Yes"}]
[null,null,null,null,null,null,null,null,null,null,null,null,0,{"$error":"#VALUE!"},{"$error":"#VALUE!"},0,{"$error":"#VALUE!"},{"$error":"#VALUE!"},0,{"$error":"#VALUE!"},{"$f":"IF(S600<='Collection System Summary_Table'!$I$8,\"Yes\",\"NO\")","v":"Yes"}]
[null,null,null,null,null,null,null,null,null,null,null,null,0,{"$error":"#VALUE!"},{"$error":"#VALUE!"},0,{"$error":"#VALUE!"},{"$error":"#VALUE!"},0,{"$error":"#VALUE!"},{"$f":"IF(S601<='Collection System Summary_Table'!$I$8,\"Yes\",\"NO\")","v":"Yes"}]
[null,null,null,null,null,null,null,null,null,null,null,null,0,{"$error":"#VALUE!"},{"$error":"#VALUE!"},0,{"$error":"#VALUE!"},{"$error":"#VALUE!"},0,{"$error":"#VALUE!"},{"$f":"IF(S602<='Collection System Summary_Table'!$I$8,\"Yes\",\"NO\")","v":"Yes"}]
[null,null,null,null,null,null,null,null,null,null,null,null,0,{"$error":"#VALUE!"},{"$error":"#VALUE!"},0,{"$error":"#VALUE!"},{"$error":"#VALUE!"},0,{"$error":"#VALUE!"},{"$f":"IF(S603<='Collection System Summary_Table'!$I$8,\"Yes\",\"NO\")","v":"Yes"}]
[null,null,null,null,null,null,null,null,null,null,null,null,0,{"$error":"#VALUE!"},{"$error":"#VALUE!"},0,{"$error":"#VALUE!"},{"$error":"#VALUE!"},0,{"$error":"#VALUE!"},{"$f":"IF(S604<='Collection System Summary_Table'!$I$8,\"Yes\",\"NO\")","v":"Yes"}]
[null,null,null,null,null,null,null,null,null,null,null,null,0,{"$error":"#VALUE!"},{"$error":"#VALUE!"},0,{"$error":"#VALUE!"},{"$error":"#VALUE!"},0,{"$error":"#VALUE!"},{"$f":"IF(S605<='Collection System Summary_Table'!$I$8,\"Yes\",\"NO\")","v":"Yes"}]
[null,null,null,null,null,null,null,null,null,null,null,null,0,{"$error":"#VALUE!"},{"$error":"#VALUE!"},0,{"$error":"#VALUE!"},{"$error":"#VALUE!"},0,{"$error":"#VALUE!"},{"$f":"IF(S606<='Collection System Summary_Table'!$I$8,\"Yes\",\"NO\")","v":"Yes"}]
[null,null,null,null,null,null,null,null,null,null,null,null,0,{"$error":"#VALUE!"},{"$error":"#VALUE!"},0,{"$error":"#VALUE!"},{"$error":"#VALUE!"},0,{"$error":"#VALUE!"},{"$f":"IF(S607<='Collection System Summary_Table'!$I$8,\"Yes\",\"NO\")","v":"Yes"}]
[null,null,null,null,null,null,null,null,null,null,null,null,0,{"$error":"#VALUE!"},{"$error":"#VALUE!"},0,{"$error":"#VALUE!"},{"$error":"#VALUE!"},0,{"$error":"#VALUE!"},{"$f":"IF(S608<='Collection System Summary_Table'!$I$8,\"Yes\",\"NO\")","v":"Yes"}]
[null,null,null,null,null,null,null,null,null,null,null,null,0,{"$error":"#VALUE!"},{"$error":"#VALUE!"},0,{"$error":"#VALUE!"},{"$error":"#VALUE!"},0,{"$error":"#VALUE!"},{"$f":"IF(S609<='Collection System Summary_Table'!$I$8,\"Yes\",\"NO\")","v":"Yes"}]
[null,null,null,null,null,null,null,null,null,null,null,null,0,{"$error":"#VALUE!"},{"$error":"#VALUE!"},0,{"$error":"#VALUE!"},{"$error":"#VALUE!"},0,{"$error":"#VALUE!"},{"$f":"IF(S610<='Collection System Summary_Table'!$I$8,\"Yes\",\"NO\")","v":"Yes"}]
[null,null,null,null,null,null,null,null,null,null,null,null,0,{"$error":"#VALUE!"},{"$error":"#VALUE!"},0,{"$error":"#VALUE!"},{"$error":"#VALUE!"},0,{"$error":"#VALUE!"},{"$f":"IF(S611<='Collection System Summary_Table'!$I$8,\"Yes\",\"NO\")","v":"Yes"}]
[null,null,null,null,null,null,null,null,null,null,null,null,0,{"$error":"#VALUE!"},{"$error":"#VALUE!"},0,{"$error":"#VALUE!"},{"$error":"#VALUE!"},0,{"$error":"#VALUE!"},{"$f":"IF(S612<='Collection System Summary_Table'!$I$8,\"Yes\",\"NO\")","v":"Yes"}]
[null,null,null,null,null,null,null,null,null,null,null,null,0,{"$error":"#VALUE!"},{"$error":"#VALUE!"},0,{"$error":"#VALUE!"},{"$error":"#VALUE!"},0,{"$error":"#VALUE!"},{"$f":"IF(S613<='Collection System Summary_Table'!$I$8,\"Yes\",\"NO\")","v":"Yes"}]
[null,null,null,null,null,null,null,null,null,null,null,null,0,{"$error":"#VALUE!"},{"$error":"#VALUE!"},0,{"$error":"#VALUE!"},{"$error":"#VALUE!"},0,{"$error":"#VALUE!"},{"$f":"IF(S614<='Collection System Summary_Table'!$I$8,\"Yes\",\"NO\")","v":"Yes"}]
[null,null,null,null,null,null,null,null,null,null,null,null,0,{"$error":"#VALUE!"},{"$error":"#VALUE!"},0,{"$error":"#VALUE!"},{"$error":"#VALUE!"},0,{"$error":"#VALUE!"},{"$f":"IF(S615<='Collection System Summary_Table'!$I$8,\"Yes\",\"NO\")","v":"Yes"}]
[null,null,null,null,null,null,null,null,null,null,null,null,0,{"$error":"#VALUE!"},{"$error":"#VALUE!"},0,{"$error":"#VALUE!"},{"$error":"#VALUE!"},0,{"$error":"#VALUE!"},{"$f":"IF(S616<='Collection System Summary_Table'!$I$8,\"Yes\",\"NO\")","v":"Yes"}]
[null,null,null,null,null,null,null,null,null,null,null,null,0,{"$error":"#VALUE!"},{"$error":"#VALUE!"},0,{"$error":"#VALUE!"},{"$error":"#VALUE!"},0,{"$error":"#VALUE!"},{"$f":"IF(S617<='Collection System Summary_Table'!$I$8,\"Yes\",\"NO\")","v":"Yes"}]
[null,null,null,null,null,null,null,null,null,null,null,null,0,{"$error":"#VALUE!"},{"$error":"#VALUE!"},0,{"$error":"#VALUE!"},{"$error":"#VALUE!"},0,{"$error":"#VALUE!"},{"$f":"IF(S618<='Collection System Summary_Table'!$I$8,\"Yes\",\"NO\")","v":"Yes"}]
[null,null,null,null,null,null,null,null,null,null,null,null,0,{"$error":"#VALUE!"},{"$error":"#VALUE!"},0,{"$error":"#VALUE!"},{"$error":"#VALUE!"},0,{"$error":"#VALUE!"},{"$f":"IF(S619<='Collection System Summary_Table'!$I$8,\"Yes\",\"NO\")","v":"Yes"}]
[null,null,null,null,null,null,null,null,null,null,null,null,0,{"$error":"#VALUE!"},{"$error":"#VALUE!"},0,{"$error":"#VALUE!"},{"$error":"#VALUE!"},0,{"$error":"#VALUE!"},{"$f":"IF(S620<='Collection System Summary_Table'!$I$8,\"Yes\",\"NO\")","v":"Yes"}]
[null,null,null,null,null,null,null,null,null,null,null,null,0,{"$error":"#VALUE!"},{"$error":"#VALUE!"},0,{"$error":"#VALUE!"},{"$error":"#VALUE!"},0,{"$error":"#VALUE!"},{"$f":"IF(S621<='Collection System Summary_Table'!$I$8,\"Yes\",\"NO\")","v":"Yes"}]
[null,null,null,null,null,null,null,null,null,null,null,null,0,{"$error":"#VALUE!"},{"$error":"#VALUE!"},0,{"$error":"#VALUE!"},{"$error":"#VALUE!"},0,{"$error":"#VALUE!"},{"$f":"IF(S622<='Collection System Summary_Table'!$I$8,\"Yes\",\"NO\")","v":"Yes"}]
[null,null,null,null,null,null,null,null,null,null,null,null,0,{"$error":"#VALUE!"},{"$error":"#VALUE!"},0,{"$error":"#VALUE!"},{"$error":"#VALUE!"},0,{"$error":"#VALUE!"},{"$f":"IF(S623<='Collection System Summary_Table'!$I$8,\"Yes\",\"NO\")","v":"Yes"}]
[null,null,null,null,null,null,null,null,null,null,null,null,0,{"$error":"#VALUE!"},{"$error":"#VALUE!"},0,{"$error":"#VALUE!"},{"$error":"#VALUE!"},0,{"$error":"#VALUE!"},{"$f":"IF(S624<='Collection System Summary_Table'!$I$8,\"Yes\",\"NO\")","v":"Yes"}]
[null,null,null,null,null,null,null,null,null,null,null,null,0,{"$error":"#VALUE!"},{"$error":"#VALUE!"},0,{"$error":"#VALUE!"},{"$error":"#VALUE!"},0,{"$error":"#VALUE!"},{"$f":"IF(S625<='Collection System Summary_Table'!$I$8,\"Yes\",\"NO\")","v":"Yes"}]
[null,null,null,null,null,null,null,null,null,null,null,null,0,{"$error":"#VALUE!"},{"$error":"#VALUE!"},0,{"$error":"#VALUE!"},{"$error":"#VALUE!"},0,{"$error":"#VALUE!"},{"$f":"IF(S626<='Collection System Summary_Table'!$I$8,\"Yes\",\"NO\")","v":"Yes"}]
[null,null,null,null,null,null,null,null,null,null,null,null,0,{"$error":"#VALUE!"},{"$error":"#VALUE!"},0,{"$error":"#VALUE!"},{"$error":"#VALUE!"},0,{"$error":"#VALUE!"},{"$f":"IF(S627<='Collection System Summary_Table'!$I$8,\"Yes\",\"NO\")","v":"Yes"}]
[null,null,null,null,null,null,null,null,null,null,null,null,0,{"$error":"#VALUE!"},{"$error":"#VALUE!"},0,{"$error":"#VALUE!"},{"$error":"#VALUE!"},0,{"$error":"#VALUE!"},{"$f":"IF(S628<='Collection System Summary_Table'!$I$8,\"Yes\",\"NO\")","v":"Yes"}]
[null,null,null,null,null,null,null,null,null,null,null,null,0,{"$error":"#VALUE!"},{"$error":"#VALUE!"},0,{"$error":"#VALUE!"},{"$error":"#VALUE!"},0,{"$error":"#VALUE!"},{"$f":"IF(S629<='Collection System Summary_Table'!$I$8,\"Yes\",\"NO\")","v":"Yes"}]
[null,null,null,null,null,null,null,null,null,null,null,null,0,{"$error":"#VALUE!"},{"$error":"#VALUE!"},0,{"$error":"#VALUE!"},{"$error":"#VALUE!"},0,{"$error":"#VALUE!"},{"$f":"IF(S630<='Collection System Summary_Table'!$I$8,\"Yes\",\"NO\")","v":"Yes"}]
[null,null,null,null,null,null,null,null,null,null,null,null,0,{"$error":"#VALUE!"},{"$error":"#VALUE!"},0,{"$error":"#VALUE!"},{"$error":"#VALUE!"},0,{"$error":"#VALUE!"},{"$f":"IF(S631<='Collection System Summary_Table'!$I$8,\"Yes\",\"NO\")","v":"Yes"}]
[null,null,null,null,null,null,null,null,null,null,null,null,0,{"$error":"#VALUE!"},{"$error":"#VALUE!"},0,{"$error":"#VALUE!"},{"$error":"#VALUE!"},0,{"$error":"#VALUE!"},{"$f":"IF(S632<='Collection System Summary_Table'!$I$8,\"Yes\",\"NO\")","v":"Yes"}]
[null,null,null,null,null,null,null,null,null,null,null,null,0,{"$error":"#VALUE!"},{"$error":"#VALUE!"},0,{"$error":"#VALUE!"},{"$error":"#VALUE!"},0,{"$error":"#VALUE!"},{"$f":"IF(S633<='Collection System Summary_Table'!$I$8,\"Yes\",\"NO\")","v":"Yes"}]
[null,null,null,null,null,null,null,null,null,null,null,null,0,{"$error":"#VALUE!"},{"$error":"#VALUE!"},0,{"$error":"#VALUE!"},{"$error":"#VALUE!"},0,{"$error":"#VALUE!"},{"$f":"IF(S634<='Collection System Summary_Table'!$I$8,\"Yes\",\"NO\")","v":"Yes"}]
[null,null,null,null,null,null,null,null,null,null,null,null,0,{"$error":"#VALUE!"},{"$error":"#VALUE!"},0,{"$error":"#VALUE!"},{"$error":"#VALUE!"},0,{"$error":"#VALUE!"},{"$f":"IF(S635<='Collection System Summary_Table'!$I$8,\"Yes\",\"NO\")","v":"Yes"}]
[null,null,null,null,null,null,null,null,null,null,null,null,0,{"$error":"#VALUE!"},{"$error":"#VALUE!"},0,{"$error":"#VALUE!"},{"$error":"#VALUE!"},0,{"$error":"#VALUE!"},{"$f":"IF(S636<='Collection System Summary_Table'!$I$8,\"Yes\",\"NO\")","v":"Yes"}]
[null,null,null,null,null,null,null,null,null,null,null,null,0,{"$error":"#VALUE!"},{"$error":"#VALUE!"},0,{"$error":"#VALUE!"},{"$error":"#VALUE!"},0,{"$error":"#VALUE!"},{"$f":"IF(S637<='Collection System Summary_Table'!$I$8,\"Yes\",\"NO\")","v":"Yes"}]
[null,null,null,null,null,null,null,null,null,null,null,null,0,{"$error":"#VALUE!"},{"$error":"#VALUE!"},0,{"$error":"#VALUE!"},{"$error":"#VALUE!"},0,{"$error":"#VALUE!"},{"$f":"IF(S638<='Collection System Summary_Table'!$I$8,\"Yes\",\"NO\")","v":"Yes"}]
[null,null,null,null,null,null,null,null,null,null,null,null,0,{"$error":"#VALUE!"},{"$error":"#VALUE!"},0,{"$error":"#VALUE!"},{"$error":"#VALUE!"},0,{"$error":"#VALUE!"},{"$f":"IF(S639<='Collection System Summary_Table'!$I$8,\"Yes\",\"NO\")","v":"Yes"}]
[null,null,null,null,null,null,null,null,null,null,null,null,0,{"$error":"#VALUE!"},{"$error":"#VALUE!"},0,{"$error":"#VALUE!"},{"$error":"#VALUE!"},0,{"$error":"#VALUE!"},{"$f":"IF(S640<='Collection System Summary_Table'!$I$8,\"Yes\",\"NO\")","v":"Yes"}]
[null,null,null,null,null,null,null,null,null,null,null,null,0,{"$error":"#VALUE!"},{"$error":"#VALUE!"},0,{"$error":"#VALUE!"},{"$error":"#VALUE!"},0,{"$error":"#VALUE!"},{"$f":"IF(S641<='Collection System Summary_Table'!$I$8,\"Yes\",\"NO\")","v":"Yes"}]
[null,null,null,null,null,null,null,null,null,null,null,null,0,{"$error":"#VALUE!"},{"$error":"#VALUE!"},0,{"$error":"#VALUE!"},{"$error":"#VALUE!"},0,{"$error":"#VALUE!"},{"$f":"IF(S642<='Collection System Summary_Table'!$I$8,\"Yes\",\"NO\")","v":"Yes"}]
[null,null,null,null,null,null,null,null,null,null,null,null,0,{"$f":"IF(P643=0,I643+N642,0)","v":{"$error":"#VALUE!"}},{"$error":"#VALUE!"},0,{"$error":"#VALUE!"},{"$error":"#VALUE!"},0,{"$error":"#VALUE!"},{"$f":"IF(S643<='Collection System Summary_Table'!$I$8,\"Yes\",\"NO\")","v":"Yes"}]
[null,null,null,null,null,null,null,null,null,null,null,null,0,{"$error":"#VALUE!"},{"$f":"IF(AND(Q644=0,P644=0),K644+O643,0)","v":{"$error":"#VALUE!"}},0,{"$f":"IF(AND(P644=0,N644<($B$4+$P$1)),J644,0)","v":{"$error":"#VALUE!"}},{"$f":"IF(AND(P644=0,Q644=0,O644<($B$5+$Q$1)),K644,0)","v":{"$error":"#VALUE!"}},{"$f":"S643+L644","v":0},{"$f":"IF(OR(P644>1,Q644>1,R644>1),\"YES\",\"NO\")","v":{"$error":"#VALUE!"}},{"$f":"IF(S644<='Collection System Summary_Table'!$I$8,\"Yes\",\"NO\")","v":"Yes"}]
[null,null,null,null,null,null,null,null,null,null,null,null,{"$f":"M644+I645","v":0},{"$error":"#VALUE!"},{"$error":"#VALUE!"},{"$f":"IF(M645<=$B$3,I645,0)","v":0},{"$error":"#VALUE!"},{"$error":"#VALUE!"},0,{"$error":"#VALUE!"},{"$f":"IF(S645<='Collection System Summary_Table'!$I$8,\"Yes\",\"NO\")","v":"Yes"}]
[null,null,null,null,null,null,null,null,null,null,null,null,0,{"$error":"#VALUE!"},{"$error":"#VALUE!"},0,{"$error":"#VALUE!"},{"$error":"#VALUE!"},0,{"$error":"#VALUE!"},{"$f":"IF(S646<='Collection System Summary_Table'!$I$8,\"Yes\",\"NO\")","v":"Yes"}]
[null,null,null,null,null,null,null,null,null,null,null,null,0,{"$error":"#VALUE!"},{"$error":"#VALUE!"},0,{"$error":"#VALUE!"},{"$error":"#VALUE!"},0,{"$error":"#VALUE!"},{"$f":"IF(S647<='Collection System Summary_Table'!$I$8,\"Yes\",\"NO\")","v":"Yes"}]
[null,null,null,null,null,null,null,null,null,null,null,null,0,{"$error":"#VALUE!"},{"$error":"#VALUE!"},0,{"$error":"#VALUE!"},{"$error":"#VALUE!"},0,{"$error":"#VALUE!"},{"$f":"IF(S648<='Collection System Summary_Table'!$I$8,\"Yes\",\"NO\")","v":"Yes"}]
[null,null,null,null,null,null,null,null,null,null,null,null,0,{"$error":"#VALUE!"},{"$error":"#VALUE!"},0,{"$error":"#VALUE!"},{"$error":"#VALUE!"},0,{"$error":"#VALUE!"},{"$f":"IF(S649<='Collection System Summary_Table'!$I$8,\"Yes\",\"NO\")","v":"Yes"}]
[null,null,null,null,null,null,null,null,null,null,null,null,0,{"$error":"#VALUE!"},{"$error":"#VALUE!"},0,{"$error":"#VALUE!"},{"$error":"#VALUE!"},0,{"$error":"#VALUE!"},{"$f":"IF(S650<='Collection System Summary_Table'!$I$8,\"Yes\",\"NO\")","v":"Yes"}]
[null,null,null,null,null,null,null,null,null,null,null,null,0,{"$error":"#VALUE!"},{"$error":"#VALUE!"},0,{"$error":"#VALUE!"},{"$error":"#VALUE!"},0,{"$error":"#VALUE!"},{"$f":"IF(S651<='Collection System Summary_Table'!$I$8,\"Yes\",\"NO\")","v":"Yes"}]
[null,null,null,null,null,null,null,null,null,null,null,null,0,{"$error":"#VALUE!"},{"$error":"#VALUE!"},0,{"$error":"#VALUE!"},{"$error":"#VALUE!"},0,{"$error":"#VALUE!"},{"$f":"IF(S652<='Collection System Summary_Table'!$I$8,\"Yes\",\"NO\")","v":"Yes"}]
[null,null,null,null,null,null,null,null,null,null,null,null,0,{"$error":"#VALUE!"},{"$error":"#VALUE!"},0,{"$error":"#VALUE!"},{"$error":"#VALUE!"},0,{"$error":"#VALUE!"},{"$f":"IF(S653<='Collection System Summary_Table'!$I$8,\"Yes\",\"NO\")","v":"Yes"}]
[null,null,null,null,null,null,null,null,null,null,null,null,0,{"$error":"#VALUE!"},{"$error":"#VALUE!"},0,{"$error":"#VALUE!"},{"$error":"#VALUE!"},0,{"$error":"#VALUE!"},{"$f":"IF(S654<='Collection System Summary_Table'!$I$8,\"Yes\",\"NO\")","v":"Yes"}]
[null,null,null,null,null,null,null,null,null,null,null,null,0,{"$error":"#VALUE!"},{"$error":"#VALUE!"},0,{"$error":"#VALUE!"},{"$error":"#VALUE!"},0,{"$error":"#VALUE!"},{"$f":"IF(S655<='Collection System Summary_Table'!$I$8,\"Yes\",\"NO\")","v":"Yes"}]
[null,null,null,null,null,null,null,null,null,null,null,null,0,{"$error":"#VALUE!"},{"$error":"#VALUE!"},0,{"$error":"#VALUE!"},{"$error":"#VALUE!"},0,{"$error":"#VALUE!"},{"$f":"IF(S656<='Collection System Summary_Table'!$I$8,\"Yes\",\"NO\")","v":"Yes"}]
[null,null,null,null,null,null,null,null,null,null,null,null,0,{"$error":"#VALUE!"},{"$error":"#VALUE!"},0,{"$error":"#VALUE!"},{"$error":"#VALUE!"},0,{"$error":"#VALUE!"},{"$f":"IF(S657<='Collection System Summary_Table'!$I$8,\"Yes\",\"NO\")","v":"Yes"}]
[null,null,null,null,null,null,null,null,null,null,null,null,0,{"$error":"#VALUE!"},{"$error":"#VALUE!"},0,{"$error":"#VALUE!"},{"$error":"#VALUE!"},0,{"$error":"#VALUE!"},{"$f":"IF(S658<='Collection System Summary_Table'!$I$8,\"Yes\",\"NO\")","v":"Yes"}]
[null,null,null,null,null,null,null,null,null,null,null,null,0,{"$error":"#VALUE!"},{"$error":"#VALUE!"},0,{"$error":"#VALUE!"},{"$error":"#VALUE!"},0,{"$error":"#VALUE!"},{"$f":"IF(S659<='Collection System Summary_Table'!$I$8,\"Yes\",\"NO\")","v":"Yes"}]
[null,null,null,null,null,null,null,null,null,null,null,null,0,{"$error":"#VALUE!"},{"$error":"#VALUE!"},0,{"$error":"#VALUE!"},{"$error":"#VALUE!"},0,{"$error":"#VALUE!"},{"$f":"IF(S660<='Collection System Summary_Table'!$I$8,\"Yes\",\"NO\")","v":"Yes"}]
[null,null,null,null,null,null,null,null,null,null,null,null,0,{"$error":"#VALUE!"},{"$error":"#VALUE!"},0,{"$error":"#VALUE!"},{"$error":"#VALUE!"},0,{"$error":"#VALUE!"},{"$f":"IF(S661<='Collection System Summary_Table'!$I$8,\"Yes\",\"NO\")","v":"Yes"}]
[null,null,null,null,null,null,null,null,null,null,null,null,0,{"$error":"#VALUE!"},{"$error":"#VALUE!"},0,{"$error":"#VALUE!"},{"$error":"#VALUE!"},0,{"$error":"#VALUE!"},{"$f":"IF(S662<='Collection System Summary_Table'!$I$8,\"Yes\",\"NO\")","v":"Yes"}]
[null,null,null,null,null,null,null,null,null,null,null,null,0,{"$error":"#VALUE!"},{"$error":"#VALUE!"},0,{"$error":"#VALUE!"},{"$error":"#VALUE!"},0,{"$error":"#VALUE!"},{"$f":"IF(S663<='Collection System Summary_Table'!$I$8,\"Yes\",\"NO\")","v":"Yes"}]
[null,null,null,null,null,null,null,null,null,null,null,null,0,{"$error":"#VALUE!"},{"$error":"#VALUE!"},0,{"$error":"#VALUE!"},{"$error":"#VALUE!"},0,{"$error":"#VALUE!"},{"$f":"IF(S664<='Collection System Summary_Table'!$I$8,\"Yes\",\"NO\")","v":"Yes"}]
[null,null,null,null,null,null,null,null,null,null,null,null,0,{"$error":"#VALUE!"},{"$error":"#VALUE!"},0,{"$error":"#VALUE!"},{"$error":"#VALUE!"},0,{"$error":"#VALUE!"},{"$f":"IF(S665<='Collection System Summary_Table'!$I$8,\"Yes\",\"NO\")","v":"Yes"}]
[null,null,null,null,null,null,null,null,null,null,null,null,0,{"$error":"#VALUE!"},{"$error":"#VALUE!"},0,{"$error":"#VALUE!"},{"$error":"#VALUE!"},0,{"$error":"#VALUE!"},{"$f":"IF(S666<='Collection System Summary_Table'!$I$8,\"Yes\",\"NO\")","v":"Yes"}]
[null,null,null,null,null,null,null,null,null,null,null,null,0,{"$error":"#VALUE!"},{"$error":"#VALUE!"},0,{"$error":"#VALUE!"},{"$error":"#VALUE!"},0,{"$error":"#VALUE!"},{"$f":"IF(S667<='Collection System Summary_Table'!$I$8,\"Yes\",\"NO\")","v":"Yes"}]
[null,null,null,null,null,null,null,null,null,null,null,null,0,{"$error":"#VALUE!"},{"$error":"#VALUE!"},0,{"$error":"#VALUE!"},{"$error":"#VALUE!"},0,{"$error":"#VALUE!"},{"$f":"IF(S668<='Collection System Summary_Table'!$I$8,\"Yes\",\"NO\")","v":"Yes"}]
[null,null,null,null,null,null,null,null,null,null,null,null,0,{"$error":"#VALUE!"},{"$error":"#VALUE!"},0,{"$error":"#VALUE!"},{"$error":"#VALUE!"},0,{"$error":"#VALUE!"},{"$f":"IF(S669<='Collection System Summary_Table'!$I$8,\"Yes\",\"NO\")","v":"Yes"}]
[null,null,null,null,null,null,null,null,null,null,null,null,0,{"$error":"#VALUE!"},{"$error":"#VALUE!"},0,{"$error":"#VALUE!"},{"$error":"#VALUE!"},0,{"$error":"#VALUE!"},{"$f":"IF(S670<='Collection System Summary_Table'!$I$8,\"Yes\",\"NO\")","v":"Yes"}]
[null,null,null,null,null,null,null,null,null,null,null,null,0,{"$error":"#VALUE!"},{"$error":"#VALUE!"},0,{"$error":"#VALUE!"},{"$error":"#VALUE!"},0,{"$error":"#VALUE!"},{"$f":"IF(S671<='Collection System Summary_Table'!$I$8,\"Yes\",\"NO\")","v":"Yes"}]
[null,null,null,null,null,null,null,null,null,null,null,null,0,{"$error":"#VALUE!"},{"$error":"#VALUE!"},0,{"$error":"#VALUE!"},{"$error":"#VALUE!"},0,{"$error":"#VALUE!"},{"$f":"IF(S672<='Collection System Summary_Table'!$I$8,\"Yes\",\"NO\")","v":"Yes"}]
[null,null,null,null,null,null,null,null,null,null,null,null,0,{"$error":"#VALUE!"},{"$error":"#VALUE!"},0,{"$error":"#VALUE!"},{"$error":"#VALUE!"},0,{"$error":"#VALUE!"},{"$f":"IF(S673<='Collection System Summary_Table'!$I$8,\"Yes\",\"NO\")","v":"Yes"}]
[null,null,null,null,null,null,null,null,null,null,null,null,0,{"$error":"#VALUE!"},{"$error":"#VALUE!"},0,{"$error":"#VALUE!"},{"$error":"#VALUE!"},0,{"$error":"#VALUE!"},{"$f":"IF(S674<='Collection System Summary_Table'!$I$8,\"Yes\",\"NO\")","v":"Yes"}]
[null,null,null,null,null,null,null,null,null,null,null,null,0,{"$error":"#VALUE!"},{"$error":"#VALUE!"},0,{"$error":"#VALUE!"},{"$error":"#VALUE!"},0,{"$error":"#VALUE!"},{"$f":"IF(S675<='Collection System Summary_Table'!$I$8,\"Yes\",\"NO\")","v":"Yes"}]
[null,null,null,null,null,null,null,null,null,null,null,null,0,{"$error":"#VALUE!"},{"$error":"#VALUE!"},0,{"$error":"#VALUE!"},{"$error":"#VALUE!"},0,{"$error":"#VALUE!"},{"$f":"IF(S676<='Collection System Summary_Table'!$I$8,\"Yes\",\"NO\")","v":"Yes"}]
[null,null,null,null,null,null,null,null,null,null,null,null,0,{"$error":"#VALUE!"},{"$error":"#VALUE!"},0,{"$error":"#VALUE!"},{"$error":"#VALUE!"},0,{"$error":"#VALUE!"},{"$f":"IF(S677<='Collection System Summary_Table'!$I$8,\"Yes\",\"NO\")","v":"Yes"}]
[null,null,null,null,null,null,null,null,null,null,null,null,0,{"$error":"#VALUE!"},{"$error":"#VALUE!"},0,{"$error":"#VALUE!"},{"$error":"#VALUE!"},0,{"$error":"#VALUE!"},{"$f":"IF(S678<='Collection System Summary_Table'!$I$8,\"Yes\",\"NO\")","v":"Yes"}]
[null,null,null,null,null,null,null,null,null,null,null,null,0,{"$error":"#VALUE!"},{"$error":"#VALUE!"},0,{"$error":"#VALUE!"},{"$error":"#VALUE!"},0,{"$error":"#VALUE!"},{"$f":"IF(S679<='Collection System Summary_Table'!$I$8,\"Yes\",\"NO\")","v":"Yes"}]
[null,null,null,null,null,null,null,null,null,null,null,null,0,{"$error":"#VALUE!"},{"$error":"#VALUE!"},0,{"$error":"#VALUE!"},{"$error":"#VALUE!"},0,{"$error":"#VALUE!"},{"$f":"IF(S680<='Collection System Summary_Table'!$I$8,\"Yes\",\"NO\")","v":"Yes"}]
[null,null,null,null,null,null,null,null,null,null,null,null,0,{"$error":"#VALUE!"},{"$error":"#VALUE!"},0,{"$error":"#VALUE!"},{"$error":"#VALUE!"},0,{"$error":"#VALUE!"},{"$f":"IF(S681<='Collection System Summary_Table'!$I$8,\"Yes\",\"NO\")","v":"Yes"}]
[null,null,null,null,null,null,null,null,null,null,null,null,0,{"$error":"#VALUE!"},{"$error":"#VALUE!"},0,{"$error":"#VALUE!"},{"$error":"#VALUE!"},0,{"$error":"#VALUE!"},{"$f":"IF(S682<='Collection System Summary_Table'!$I$8,\"Yes\",\"NO\")","v":"Yes"}]
[null,null,null,null,null,null,null,null,null,null,null,null,0,{"$error":"#VALUE!"},{"$error":"#VALUE!"},0,{"$error":"#VALUE!"},{"$error":"#VALUE!"},0,{"$error":"#VALUE!"},{"$f":"IF(S683<='Collection System Summary_Table'!$I$8,\"Yes\",\"NO\")","v":"Yes"}]
[null,null,null,null,null,null,null,null,null,null,null,null,0,{"$error":"#VALUE!"},{"$error":"#VALUE!"},0,{"$error":"#VALUE!"},{"$error":"#VALUE!"},0,{"$error":"#VALUE!"},{"$f":"IF(S684<='Collection System Summary_Table'!$I$8,\"Yes\",\"NO\")","v":"Yes"}]
[null,null,null,null,null,null,null,null,null,null,null,null,0,{"$error":"#VALUE!"},{"$error":"#VALUE!"},0,{"$error":"#VALUE!"},{"$error":"#VALUE!"},0,{"$error":"#VALUE!"},{"$f":"IF(S685<='Collection System Summary_Table'!$I$8,\"Yes\",\"NO\")","v":"Yes"}]
[null,null,null,null,null,null,null,null,null,null,null,null,0,{"$error":"#VALUE!"},{"$error":"#VALUE!"},0,{"$error":"#VALUE!"},{"$error":"#VALUE!"},0,{"$error":"#VALUE!"},{"$f":"IF(S686<='Collection System Summary_Table'!$I$8,\"Yes\",\"NO\")","v":"Yes"}]
[null,null,null,null,null,null,null,null,null,null,null,null,0,{"$error":"#VALUE!"},{"$error":"#VALUE!"},0,{"$error":"#VALUE!"},{"$error":"#VALUE!"},0,{"$error":"#VALUE!"},{"$f":"IF(S687<='Collection System Summary_Table'!$I$8,\"Yes\",\"NO\")","v":"Yes"}]
[null,null,null,null,null,null,null,null,null,null,null,null,0,{"$error":"#VALUE!"},{"$error":"#VALUE!"},0,{"$error":"#VALUE!"},{"$error":"#VALUE!"},0,{"$error":"#VALUE!"},{"$f":"IF(S688<='Collection System Summary_Table'!$I$8,\"Yes\",\"NO\")","v":"Yes"}]
[null,null,null,null,null,null,null,null,null,null,null,null,0,{"$error":"#VALUE!"},{"$error":"#VALUE!"},0,{"$error":"#VALUE!"},{"$error":"#VALUE!"},0,{"$error":"#VALUE!"},{"$f":"IF(S689<='Collection System Summary_Table'!$I$8,\"Yes\",\"NO\")","v":"Yes"}]
[null,null,null,null,null,null,null,null,null,null,null,null,0,{"$error":"#VALUE!"},{"$error":"#VALUE!"},0,{"$error":"#VALUE!"},{"$error":"#VALUE!"},0,{"$error":"#VALUE!"},{"$f":"IF(S690<='Collection System Summary_Table'!$I$8,\"Yes\",\"NO\")","v":"Yes"}]
[null,null,null,null,null,null,null,null,null,null,null,null,0,{"$error":"#VALUE!"},{"$error":"#VALUE!"},0,{"$error":"#VALUE!"},{"$error":"#VALUE!"},0,{"$error":"#VALUE!"},{"$f":"IF(S691<='Collection System Summary_Table'!$I$8,\"Yes\",\"NO\")","v":"Yes"}]
[null,null,null,null,null,null,null,null,null,null,null,null,0,{"$error":"#VALUE!"},{"$error":"#VALUE!"},0,{"$error":"#VALUE!"},{"$error":"#VALUE!"},0,{"$error":"#VALUE!"},{"$f":"IF(S692<='Collection System Summary_Table'!$I$8,\"Yes\",\"NO\")","v":"Yes"}]
[null,null,null,null,null,null,null,null,null,null,null,null,0,{"$error":"#VALUE!"},{"$error":"#VALUE!"},0,{"$error":"#VALUE!"},{"$error":"#VALUE!"},0,{"$error":"#VALUE!"},{"$f":"IF(S693<='Collection System Summary_Table'!$I$8,\"Yes\",\"NO\")","v":"Yes"}]
[null,null,null,null,null,null,null,null,null,null,null,null,0,{"$error":"#VALUE!"},{"$error":"#VALUE!"},0,{"$error":"#VALUE!"},{"$error":"#VALUE!"},0,{"$error":"#VALUE!"},{"$f":"IF(S694<='Collection System Summary_Table'!$I$8,\"Yes\",\"NO\")","v":"Yes"}]
[null,null,null,null,null,null,null,null,null,null,null,null,0,{"$error":"#VALUE!"},{"$error":"#VALUE!"},0,{"$error":"#VALUE!"},{"$error":"#VALUE!"},0,{"$error":"#VALUE!"},{"$f":"IF(S695<='Collection System Summary_Table'!$I$8,\"Yes\",\"NO\")","v":"Yes"}]
[null,null,null,null,null,null,null,null,null,null,null,null,0,{"$error":"#VALUE!"},{"$error":"#VALUE!"},0,{"$error":"#VALUE!"},{"$error":"#VALUE!"},0,{"$error":"#VALUE!"},{"$f":"IF(S696<='Collection System Summary_Table'!$I$8,\"Yes\",\"NO\")","v":"Yes"}]
[null,null,null,null,null,null,null,null,null,null,null,null,0,{"$error":"#VALUE!"},{"$error":"#VALUE!"},0,{"$error":"#VALUE!"},{"$error":"#VALUE!"},0,{"$error":"#VALUE!"},{"$f":"IF(S697<='Collection System Summary_Table'!$I$8,\"Yes\",\"NO\")","v":"Yes"}]
[null,null,null,null,null,null,null,null,null,null,null,null,0,{"$error":"#VALUE!"},{"$error":"#VALUE!"},0,{"$error":"#VALUE!"},{"$error":"#VALUE!"},0,{"$error":"#VALUE!"},{"$f":"IF(S698<='Collection System Summary_Table'!$I$8,\"Yes\",\"NO\")","v":"Yes"}]
[null,null,null,null,null,null,null,null,null,null,null,null,0,{"$error":"#VALUE!"},{"$error":"#VALUE!"},0,{"$error":"#VALUE!"},{"$error":"#VALUE!"},0,{"$error":"#VALUE!"},{"$f":"IF(S699<='Collection System Summary_Table'!$I$8,\"Yes\",\"NO\")","v":"Yes"}]
[null,null,null,null,null,null,null,null,null,null,null,null,0,{"$error":"#VALUE!"},{"$error":"#VALUE!"},0,{"$error":"#VALUE!"},{"$error":"#VALUE!"},0,{"$error":"#VALUE!"},{"$f":"IF(S700<='Collection System Summary_Table'!$I$8,\"Yes\",\"NO\")","v":"Yes"}]
[null,null,null,null,null,null,null,null,null,null,null,null,0,{"$error":"#VALUE!"},{"$error":"#VALUE!"},0,{"$error":"#VALUE!"},{"$error":"#VALUE!"},0,{"$error":"#VALUE!"},{"$f":"IF(S701<='Collection System Summary_Table'!$I$8,\"Yes\",\"NO\")","v":"Yes"}]
[null,null,null,null,null,null,null,null,null,null,null,null,0,{"$error":"#VALUE!"},{"$error":"#VALUE!"},0,{"$error":"#VALUE!"},{"$error":"#VALUE!"},0,{"$error":"#VALUE!"},{"$f":"IF(S702<='Collection System Summary_Table'!$I$8,\"Yes\",\"NO\")","v":"Yes"}]
[null,null,null,null,null,null,null,null,null,null,null,null,0,{"$error":"#VALUE!"},{"$error":"#VALUE!"},0,{"$error":"#VALUE!"},{"$error":"#VALUE!"},0,{"$error":"#VALUE!"},{"$f":"IF(S703<='Collection System Summary_Table'!$I$8,\"Yes\",\"NO\")","v":"Yes"}]
[null,null,null,null,null,null,null,null,null,null,null,null,0,{"$error":"#VALUE!"},{"$error":"#VALUE!"},0,{"$error":"#VALUE!"},{"$error":"#VALUE!"},0,{"$error":"#VALUE!"},{"$f":"IF(S704<='Collection System Summary_Table'!$I$8,\"Yes\",\"NO\")","v":"Yes"}]
[null,null,null,null,null,null,null,null,null,null,null,null,0,{"$error":"#VALUE!"},{"$error":"#VALUE!"},0,{"$error":"#VALUE!"},{"$error":"#VALUE!"},0,{"$error":"#VALUE!"},{"$f":"IF(S705<='Collection System Summary_Table'!$I$8,\"Yes\",\"NO\")","v":"Yes"}]
[null,null,null,null,null,null,null,null,null,null,null,null,0,{"$error":"#VALUE!"},{"$error":"#VALUE!"},0,{"$error":"#VALUE!"},{"$error":"#VALUE!"},0,{"$error":"#VALUE!"},{"$f":"IF(S706<='Collection System Summary_Table'!$I$8,\"Yes\",\"NO\")","v":"Yes"}]
[null,null,null,null,null,null,null,null,null,null,null,null,0,{"$f":"IF(P707=0,I707+N706,0)","v":{"$error":"#VALUE!"}},{"$error":"#VALUE!"},0,{"$error":"#VALUE!"},{"$error":"#VALUE!"},0,{"$error":"#VALUE!"},{"$f":"IF(S707<='Collection System Summary_Table'!$I$8,\"Yes\",\"NO\")","v":"Yes"}]
[null,null,null,null,null,null,null,null,null,null,null,null,0,{"$error":"#VALUE!"},{"$f":"IF(AND(Q708=0,P708=0),K708+O707,0)","v":{"$error":"#VALUE!"}},0,{"$f":"IF(AND(P708=0,N708<($B$4+$P$1)),J708,0)","v":{"$error":"#VALUE!"}},{"$f":"IF(AND(P708=0,Q708=0,O708<($B$5+$Q$1)),K708,0)","v":{"$error":"#VALUE!"}},{"$f":"S707+L708","v":0},{"$f":"IF(OR(P708>1,Q708>1,R708>1),\"YES\",\"NO\")","v":{"$error":"#VALUE!"}},{"$f":"IF(S708<='Collection System Summary_Table'!$I$8,\"Yes\",\"NO\")","v":"Yes"}]
[null,null,null,null,null,null,null,null,null,null,null,null,{"$f":"M708+I709","v":0},{"$error":"#VALUE!"},{"$error":"#VALUE!"},{"$f":"IF(M709<=$B$3,I709,0)","v":0},{"$error":"#VALUE!"},{"$error":"#VALUE!"},0,{"$error":"#VALUE!"},{"$f":"IF(S709<='Collection System Summary_Table'!$I$8,\"Yes\",\"NO\")","v":"Yes"}]
[null,null,null,null,null,null,null,null,null,null,null,null,0,{"$error":"#VALUE!"},{"$error":"#VALUE!"},0,{"$error":"#VALUE!"},{"$error":"#VALUE!"},0,{"$error":"#VALUE!"},{"$f":"IF(S710<='Collection System Summary_Table'!$I$8,\"Yes\",\"NO\")","v":"Yes"}]
[null,null,null,null,null,null,null,null,null,null,null,null,0,{"$error":"#VALUE!"},{"$error":"#VALUE!"},0,{"$error":"#VALUE!"},{"$error":"#VALUE!"},0,{"$error":"#VALUE!"},{"$f":"IF(S711<='Collection System Summary_Table'!$I$8,\"Yes\",\"NO\")","v":"Yes"}]
[null,null,null,null,null,null,null,null,null,null,null,null,0,{"$error":"#VALUE!"},{"$error":"#VALUE!"},0,{"$error":"#VALUE!"},{"$error":"#VALUE!"},0,{"$error":"#VALUE!"},{"$f":"IF(S712<='Collection System Summary_Table'!$I$8,\"Yes\",\"NO\")","v":"Yes"}]
[null,null,null,null,null,null,null,null,null,null,null,null,0,{"$error":"#VALUE!"},{"$error":"#VALUE!"},0,{"$error":"#VALUE!"},{"$error":"#VALUE!"},0,{"$error":"#VALUE!"},{"$f":"IF(S713<='Collection System Summary_Table'!$I$8,\"Yes\",\"NO\")","v":"Yes"}]
[null,null,null,null,null,null,null,null,null,null,null,null,0,{"$error":"#VALUE!"},{"$error":"#VALUE!"},0,{"$error":"#VALUE!"},{"$error":"#VALUE!"},0,{"$error":"#VALUE!"},{"$f":"IF(S714<='Collection System Summary_Table'!$I$8,\"Yes\",\"NO\")","v":"Yes"}]
[null,null,null,null,null,null,null,null,null,null,null,null,0,{"$error":"#VALUE!"},{"$error":"#VALUE!"},0,{"$error":"#VALUE!"},{"$error":"#VALUE!"},0,{"$error":"#VALUE!"},{"$f":"IF(S715<='Collection System Summary_Table'!$I$8,\"Yes\",\"NO\")","v":"Yes"}]
[null,null,null,null,null,null,null,null,null,null,null,null,0,{"$error":"#VALUE!"},{"$error":"#VALUE!"},0,{"$error":"#VALUE!"},{"$error":"#VALUE!"},0,{"$error":"#VALUE!"},{"$f":"IF(S716<='Collection System Summary_Table'!$I$8,\"Yes\",\"NO\")","v":"Yes"}]
[null,null,null,null,null,null,null,null,null,null,null,null,0,{"$error":"#VALUE!"},{"$error":"#VALUE!"},0,{"$error":"#VALUE!"},{"$error":"#VALUE!"},0,{"$error":"#VALUE!"},{"$f":"IF(S717<='Collection System Summary_Table'!$I$8,\"Yes\",\"NO\")","v":"Yes"}]
[null,null,null,null,null,null,null,null,null,null,null,null,0,{"$error":"#VALUE!"},{"$error":"#VALUE!"},0,{"$error":"#VALUE!"},{"$error":"#VALUE!"},0,{"$error":"#VALUE!"},{"$f":"IF(S718<='Collection System Summary_Table'!$I$8,\"Yes\",\"NO\")","v":"Yes"}]
[null,null,null,null,null,null,null,null,null,null,null,null,0,{"$error":"#VALUE!"},{"$error":"#VALUE!"},0,{"$error":"#VALUE!"},{"$error":"#VALUE!"},0,{"$error":"#VALUE!"},{"$f":"IF(S719<='Collection System Summary_Table'!$I$8,\"Yes\",\"NO\")","v":"Yes"}]
[null,null,null,null,null,null,null,null,null,null,null,null,0,{"$error":"#VALUE!"},{"$error":"#VALUE!"},0,{"$error":"#VALUE!"},{"$error":"#VALUE!"},0,{"$error":"#VALUE!"},{"$f":"IF(S720<='Collection System Summary_Table'!$I$8,\"Yes\",\"NO\")","v":"Yes"}]
[null,null,null,null,null,null,null,null,null,null,null,null,0,{"$error":"#VALUE!"},{"$error":"#VALUE!"},0,{"$error":"#VALUE!"},{"$error":"#VALUE!"},0,{"$error":"#VALUE!"},{"$f":"IF(S721<='Collection System Summary_Table'!$I$8,\"Yes\",\"NO\")","v":"Yes"}]
[null,null,null,null,null,null,null,null,null,null,null,null,0,{"$error":"#VALUE!"},{"$error":"#VALUE!"},0,{"$error":"#VALUE!"},{"$error":"#VALUE!"},0,{"$error":"#VALUE!"},{"$f":"IF(S722<='Collection System Summary_Table'!$I$8,\"Yes\",\"NO\")","v":"Yes"}]
[null,null,null,null,null,null,null,null,null,null,null,null,0,{"$error":"#VALUE!"},{"$error":"#VALUE!"},0,{"$error":"#VALUE!"},{"$error":"#VALUE!"},0,{"$error":"#VALUE!"},{"$f":"IF(S723<='Collection System Summary_Table'!$I$8,\"Yes\",\"NO\")","v":"Yes"}]
[null,null,null,null,null,null,null,null,null,null,null,null,0,{"$error":"#VALUE!"},{"$error":"#VALUE!"},0,{"$error":"#VALUE!"},{"$error":"#VALUE!"},0,{"$error":"#VALUE!"},{"$f":"IF(S724<='Collection System Summary_Table'!$I$8,\"Yes\",\"NO\")","v":"Yes"}]
[null,null,null,null,null,null,null,null,null,null,null,null,0,{"$error":"#VALUE!"},{"$error":"#VALUE!"},0,{"$error":"#VALUE!"},{"$error":"#VALUE!"},0,{"$error":"#VALUE!"},{"$f":"IF(S725<='Collection System Summary_Table'!$I$8,\"Yes\",\"NO\")","v":"Yes"}]
[null,null,null,null,null,null,null,null,null,null,null,null,0,{"$error":"#VALUE!"},{"$error":"#VALUE!"},0,{"$error":"#VALUE!"},{"$error":"#VALUE!"},0,{"$error":"#VALUE!"},{"$f":"IF(S726<='Collection System Summary_Table'!$I$8,\"Yes\",\"NO\")","v":"Yes"}]
[null,null,null,null,null,null,null,null,null,null,null,null,0,{"$error":"#VALUE!"},{"$error":"#VALUE!"},0,{"$error":"#VALUE!"},{"$error":"#VALUE!"},0,{"$error":"#VALUE!"},{"$f":"IF(S727<='Collection System Summary_Table'!$I$8,\"Yes\",\"NO\")","v":"Yes"}]
[null,null,null,null,null,null,null,null,null,null,null,null,0,{"$error":"#VALUE!"},{"$error":"#VALUE!"},0,{"$error":"#VALUE!"},{"$error":"#VALUE!"},0,{"$error":"#VALUE!"},{"$f":"IF(S728<='Collection System Summary_Table'!$I$8,\"Yes\",\"NO\")","v":"Yes"}]
[null,null,null,null,null,null,null,null,null,null,null,null,0,{"$error":"#VALUE!"},{"$error":"#VALUE!"},0,{"$error":"#VALUE!"},{"$error":"#VALUE!"},0,{"$error":"#VALUE!"},{"$f":"IF(S729<='Collection System Summary_Table'!$I$8,\"Yes\",\"NO\")","v":"Yes"}]
[null,null,null,null,null,null,null,null,null,null,null,null,0,{"$error":"#VALUE!"},{"$error":"#VALUE!"},0,{"$error":"#VALUE!"},{"$error":"#VALUE!"},0,{"$error":"#VALUE!"},{"$f":"IF(S730<='Collection System Summary_Table'!$I$8,\"Yes\",\"NO\")","v":"Yes"}]
[null,null,null,null,null,null,null,null,null,null,null,null,0,{"$error":"#VALUE!"},{"$error":"#VALUE!"},0,{"$error":"#VALUE!"},{"$error":"#VALUE!"},0,{"$error":"#VALUE!"},{"$f":"IF(S731<='Collection System Summary_Table'!$I$8,\"Yes\",\"NO\")","v":"Yes"}]
[null,null,null,null,null,null,null,null,null,null,null,null,0,{"$error":"#VALUE!"},{"$error":"#VALUE!"},0,{"$error":"#VALUE!"},{"$error":"#VALUE!"},0,{"$error":"#VALUE!"},{"$f":"IF(S732<='Collection System Summary_Table'!$I$8,\"Yes\",\"NO\")","v":"Yes"}]
[null,null,null,null,null,null,null,null,null,null,null,null,0,{"$error":"#VALUE!"},{"$error":"#VALUE!"},0,{"$error":"#VALUE!"},{"$error":"#VALUE!"},0,{"$error":"#VALUE!"},{"$f":"IF(S733<='Collection System Summary_Table'!$I$8,\"Yes\",\"NO\")","v":"Yes"}]
[null,null,null,null,null,null,null,null,null,null,null,null,0,{"$error":"#VALUE!"},{"$error":"#VALUE!"},0,{"$error":"#VALUE!"},{"$error":"#VALUE!"},0,{"$error":"#VALUE!"},{"$f":"IF(S734<='Collection System Summary_Table'!$I$8,\"Yes\",\"NO\")","v":"Yes"}]
[null,null,null,null,null,null,null,null,null,null,null,null,0,{"$error":"#VALUE!"},{"$error":"#VALUE!"},0,{"$error":"#VALUE!"},{"$error":"#VALUE!"},0,{"$error":"#VALUE!"},{"$f":"IF(S735<='Collection System Summary_Table'!$I$8,\"Yes\",\"NO\")","v":"Yes"}]
[null,null,null,null,null,null,null,null,null,null,null,null,0,{"$error":"#VALUE!"},{"$error":"#VALUE!"},0,{"$error":"#VALUE!"},{"$error":"#VALUE!"},0,{"$error":"#VALUE!"},{"$f":"IF(S736<='Collection System Summary_Table'!$I$8,\"Yes\",\"NO\")","v":"Yes"}]
[null,null,null,null,null,null,null,null,null,null,null,null,0,{"$error":"#VALUE!"},{"$error":"#VALUE!"},0,{"$error":"#VALUE!"},{"$error":"#VALUE!"},0,{"$error":"#VALUE!"},{"$f":"IF(S737<='Collection System Summary_Table'!$I$8,\"Yes\",\"NO\")","v":"Yes"}]
[null,null,null,null,null,null,null,null,null,null,null,null,0,{"$error":"#VALUE!"},{"$error":"#VALUE!"},0,{"$error":"#VALUE!"},{"$error":"#VALUE!"},0,{"$error":"#VALUE!"},{"$f":"IF(S738<='Collection System Summary_Table'!$I$8,\"Yes\",\"NO\")","v":"Yes"}]
[null,null,null,null,null,null,null,null,null,null,null,null,0,{"$error":"#VALUE!"},{"$error":"#VALUE!"},0,{"$error":"#VALUE!"},{"$error":"#VALUE!"},0,{"$error":"#VALUE!"},{"$f":"IF(S739<='Collection System Summary_Table'!$I$8,\"Yes\",\"NO\")","v":"Yes"}]
[null,null,null,null,null,null,null,null,null,null,null,null,0,{"$error":"#VALUE!"},{"$error":"#VALUE!"},0,{"$error":"#VALUE!"},{"$error":"#VALUE!"},0,{"$error":"#VALUE!"},{"$f":"IF(S740<='Collection System Summary_Table'!$I$8,\"Yes\",\"NO\")","v":"Yes"}]
[null,null,null,null,null,null,null,null,null,null,null,null,0,{"$error":"#VALUE!"},{"$error":"#VALUE!"},0,{"$error":"#VALUE!"},{"$error":"#VALUE!"},0,{"$error":"#VALUE!"},{"$f":"IF(S741<='Collection System Summary_Table'!$I$8,\"Yes\",\"NO\")","v":"Yes"}]
[null,null,null,null,null,null,null,null,null,null,null,null,0,{"$error":"#VALUE!"},{"$error":"#VALUE!"},0,{"$error":"#VALUE!"},{"$error":"#VALUE!"},0,{"$error":"#VALUE!"},{"$f":"IF(S742<='Collection System Summary_Table'!$I$8,\"Yes\",\"NO\")","v":"Yes"}]
[null,null,null,null,null,null,null,null,null,null,null,null,0,{"$error":"#VALUE!"},{"$error":"#VALUE!"},0,{"$error":"#VALUE!"},{"$error":"#VALUE!"},0,{"$error":"#VALUE!"},{"$f":"IF(S743<='Collection System Summary_Table'!$I$8,\"Yes\",\"NO\")","v":"Yes"}]
[null,null,null,null,null,null,null,null,null,null,null,null,0,{"$error":"#VALUE!"},{"$error":"#VALUE!"},0,{"$error":"#VALUE!"},{"$error":"#VALUE!"},0,{"$error":"#VALUE!"},{"$f":"IF(S744<='Collection System Summary_Table'!$I$8,\"Yes\",\"NO\")","v":"Yes"}]
[null,null,null,null,null,null,null,null,null,null,null,null,0,{"$error":"#VALUE!"},{"$error":"#VALUE!"},0,{"$error":"#VALUE!"},{"$error":"#VALUE!"},0,{"$error":"#VALUE!"},{"$f":"IF(S745<='Collection System Summary_Table'!$I$8,\"Yes\",\"NO\")","v":"Yes"}]
[null,null,null,null,null,null,null,null,null,null,null,null,0,{"$error":"#VALUE!"},{"$error":"#VALUE!"},0,{"$error":"#VALUE!"},{"$error":"#VALUE!"},0,{"$error":"#VALUE!"},{"$f":"IF(S746<='Collection System Summary_Table'!$I$8,\"Yes\",\"NO\")","v":"Yes"}]
[null,null,null,null,null,null,null,null,null,null,null,null,0,{"$error":"#VALUE!"},{"$error":"#VALUE!"},0,{"$error":"#VALUE!"},{"$error":"#VALUE!"},0,{"$error":"#VALUE!"},{"$f":"IF(S747<='Collection System Summary_Table'!$I$8,\"Yes\",\"NO\")","v":"Yes"}]
[null,null,null,null,null,null,null,null,null,null,null,null,0,{"$error":"#VALUE!"},{"$error":"#VALUE!"},0,{"$error":"#VALUE!"},{"$error":"#VALUE!"},0,{"$error":"#VALUE!"},{"$f":"IF(S748<='Collection System Summary_Table'!$I$8,\"Yes\",\"NO\")","v":"Yes"}]
[null,null,null,null,null,null,null,null,null,null,null,null,0,{"$error":"#VALUE!"},{"$error":"#VALUE!"},0,{"$error":"#VALUE!"},{"$error":"#VALUE!"},0,{"$error":"#VALUE!"},{"$f":"IF(S749<='Collection System Summary_Table'!$I$8,\"Yes\",\"NO\")","v":"Yes"}]
[null,null,null,null,null,null,null,null,null,null,null,null,0,{"$error":"#VALUE!"},{"$error":"#VALUE!"},0,{"$error":"#VALUE!"},{"$error":"#VALUE!"},0,{"$error":"#VALUE!"},{"$f":"IF(S750<='Collection System Summary_Table'!$I$8,\"Yes\",\"NO\")","v":"Yes"}]
[null,null,null,null,null,null,null,null,null,null,null,null,0,{"$error":"#VALUE!"},{"$error":"#VALUE!"},0,{"$error":"#VALUE!"},{"$error":"#VALUE!"},0,{"$error":"#VALUE!"},{"$f":"IF(S751<='Collection System Summary_Table'!$I$8,\"Yes\",\"NO\")","v":"Yes"}]
[null,null,null,null,null,null,null,null,null,null,null,null,0,{"$error":"#VALUE!"},{"$error":"#VALUE!"},0,{"$error":"#VALUE!"},{"$error":"#VALUE!"},0,{"$error":"#VALUE!"},{"$f":"IF(S752<='Collection System Summary_Table'!$I$8,\"Yes\",\"NO\")","v":"Yes"}]
[null,null,null,null,null,null,null,null,null,null,null,null,0,{"$error":"#VALUE!"},{"$error":"#VALUE!"},0,{"$error":"#VALUE!"},{"$error":"#VALUE!"},0,{"$error":"#VALUE!"},{"$f":"IF(S753<='Collection System Summary_Table'!$I$8,\"Yes\",\"NO\")","v":"Yes"}]
[null,null,null,null,null,null,null,null,null,null,null,null,0,{"$error":"#VALUE!"},{"$error":"#VALUE!"},0,{"$error":"#VALUE!"},{"$error":"#VALUE!"},0,{"$error":"#VALUE!"},{"$f":"IF(S754<='Collection System Summary_Table'!$I$8,\"Yes\",\"NO\")","v":"Yes"}]
[null,null,null,null,null,null,null,null,null,null,null,null,0,{"$error":"#VALUE!"},{"$error":"#VALUE!"},0,{"$error":"#VALUE!"},{"$error":"#VALUE!"},0,{"$error":"#VALUE!"},{"$f":"IF(S755<='Collection System Summary_Table'!$I$8,\"Yes\",\"NO\")","v":"Yes"}]
[null,null,null,null,null,null,null,null,null,null,null,null,0,{"$error":"#VALUE!"},{"$error":"#VALUE!"},0,{"$error":"#VALUE!"},{"$error":"#VALUE!"},0,{"$error":"#VALUE!"},{"$f":"IF(S756<='Collection System Summary_Table'!$I$8,\"Yes\",\"NO\")","v":"Yes"}]
[null,null,null,null,null,null,null,null,null,null,null,null,0,{"$error":"#VALUE!"},{"$error":"#VALUE!"},0,{"$error":"#VALUE!"},{"$error":"#VALUE!"},0,{"$error":"#VALUE!"},{"$f":"IF(S757<='Collection System Summary_Table'!$I$8,\"Yes\",\"NO\")","v":"Yes"}]
[null,null,null,null,null,null,null,null,null,null,null,null,0,{"$error":"#VALUE!"},{"$error":"#VALUE!"},0,{"$error":"#VALUE!"},{"$error":"#VALUE!"},0,{"$error":"#VALUE!"},{"$f":"IF(S758<='Collection System Summary_Table'!$I$8,\"Yes\",\"NO\")","v":"Yes"}]
[null,null,null,null,null,null,null,null,null,null,null,null,0,{"$error":"#VALUE!"},{"$error":"#VALUE!"},0,{"$error":"#VALUE!"},{"$error":"#VALUE!"},0,{"$error":"#VALUE!"},{"$f":"IF(S759<='Collection System Summary_Table'!$I$8,\"Yes\",\"NO\")","v":"Yes"}]
[null,null,null,null,null,null,null,null,null,null,null,null,0,{"$error":"#VALUE!"},{"$error":"#VALUE!"},0,{"$error":"#VALUE!"},{"$error":"#VALUE!"},0,{"$error":"#VALUE!"},{"$f":"IF(S760<='Collection System Summary_Table'!$I$8,\"Yes\",\"NO\")","v":"Yes"}]
[null,null,null,null,null,null,null,null,null,null,null,null,0,{"$error":"#VALUE!"},{"$error":"#VALUE!"},0,{"$error":"#VALUE!"},{"$error":"#VALUE!"},0,{"$error":"#VALUE!"},{"$f":"IF(S761<='Collection System Summary_Table'!$I$8,\"Yes\",\"NO\")","v":"Yes"}]
[null,null,null,null,null,null,null,null,null,null,null,null,0,{"$error":"#VALUE!"},{"$error":"#VALUE!"},0,{"$error":"#VALUE!"},{"$error":"#VALUE!"},0,{"$error":"#VALUE!"},{"$f":"IF(S762<='Collection System Summary_Table'!$I$8,\"Yes\",\"NO\")","v":"Yes"}]
[null,null,null,null,null,null,null,null,null,null,null,null,0,{"$error":"#VALUE!"},{"$error":"#VALUE!"},0,{"$error":"#VALUE!"},{"$error":"#VALUE!"},0,{"$error":"#VALUE!"},{"$f":"IF(S763<='Collection System Summary_Table'!$I$8,\"Yes\",\"NO\")","v":"Yes"}]
[null,null,null,null,null,null,null,null,null,null,null,null,0,{"$error":"#VALUE!"},{"$error":"#VALUE!"},0,{"$error":"#VALUE!"},{"$error":"#VALUE!"},0,{"$error":"#VALUE!"},{"$f":"IF(S764<='Collection System Summary_Table'!$I$8,\"Yes\",\"NO\")","v":"Yes"}]
[null,null,null,null,null,null,null,null,null,null,null,null,0,{"$error":"#VALUE!"},{"$error":"#VALUE!"},0,{"$error":"#VALUE!"},{"$error":"#VALUE!"},0,{"$error":"#VALUE!"},{"$f":"IF(S765<='Collection System Summary_Table'!$I$8,\"Yes\",\"NO\")","v":"Yes"}]
[null,null,null,null,null,null,null,null,null,null,null,null,0,{"$error":"#VALUE!"},{"$error":"#VALUE!"},0,{"$error":"#VALUE!"},{"$error":"#VALUE!"},0,{"$error":"#VALUE!"},{"$f":"IF(S766<='Collection System Summary_Table'!$I$8,\"Yes\",\"NO\")","v":"Yes"}]
[null,null,null,null,null,null,null,null,null,null,null,null,0,{"$error":"#VALUE!"},{"$error":"#VALUE!"},0,{"$error":"#VALUE!"},{"$error":"#VALUE!"},0,{"$error":"#VALUE!"},{"$f":"IF(S767<='Collection System Summary_Table'!$I$8,\"Yes\",\"NO\")","v":"Yes"}]
[null,null,null,null,null,null,null,null,null,null,null,null,0,{"$error":"#VALUE!"},{"$error":"#VALUE!"},0,{"$error":"#VALUE!"},{"$error":"#VALUE!"},0,{"$error":"#VALUE!"},{"$f":"IF(S768<='Collection System Summary_Table'!$I$8,\"Yes\",\"NO\")","v":"Yes"}]
[null,null,null,null,null,null,null,null,null,null,null,null,0,{"$error":"#VALUE!"},{"$error":"#VALUE!"},0,{"$error":"#VALUE!"},{"$error":"#VALUE!"},0,{"$error":"#VALUE!"},{"$f":"IF(S769<='Collection System Summary_Table'!$I$8,\"Yes\",\"NO\")","v":"Yes"}]
[null,null,null,null,null,null,null,null,null,null,null,null,0,{"$error":"#VALUE!"},{"$error":"#VALUE!"},0,{"$error":"#VALUE!"},{"$error":"#VALUE!"},0,{"$error":"#VALUE!"},{"$f":"IF(S770<='Collection System Summary_Table'!$I$8,\"Yes\",\"NO\")","v":"Yes"}]
[null,null,null,null,null,null,null,null,null,null,null,null,0,{"$f":"IF(P771=0,I771+N770,0)","v":{"$error":"#VALUE!"}},{"$error":"#VALUE!"},0,{"$error":"#VALUE!"},{"$error":"#VALUE!"},0,{"$error":"#VALUE!"},{"$f":"IF(S771<='Collection System Summary_Table'!$I$8,\"Yes\",\"NO\")","v":"Yes"}]
[null,null,null,null,null,null,null,null,null,null,null,null,0,{"$error":"#VALUE!"},{"$f":"IF(AND(Q772=0,P772=0),K772+O771,0)","v":{"$error":"#VALUE!"}},0,{"$f":"IF(AND(P772=0,N772<($B$4+$P$1)),J772,0)","v":{"$error":"#VALUE!"}},{"$f":"IF(AND(P772=0,Q772=0,O772<($B$5+$Q$1)),K772,0)","v":{"$error":"#VALUE!"}},{"$f":"S771+L772","v":0},{"$f":"IF(OR(P772>1,Q772>1,R772>1),\"YES\",\"NO\")","v":{"$error":"#VALUE!"}},{"$f":"IF(S772<='Collection System Summary_Table'!$I$8,\"Yes\",\"NO\")","v":"Yes"}]
[null,null,null,null,null,null,null,null,null,null,null,null,{"$f":"M772+I773","v":0},{"$error":"#VALUE!"},{"$error":"#VALUE!"},{"$f":"IF(M773<=$B$3,I773,0)","v":0},{"$error":"#VALUE!"},{"$error":"#VALUE!"},0,{"$error":"#VALUE!"},{"$f":"IF(S773<='Collection System Summary_Table'!$I$8,\"Yes\",\"NO\")","v":"Yes"}]
[null,null,null,null,null,null,null,null,null,null,null,null,0,{"$error":"#VALUE!"},{"$error":"#VALUE!"},0,{"$error":"#VALUE!"},{"$error":"#VALUE!"},0,{"$error":"#VALUE!"},{"$f":"IF(S774<='Collection System Summary_Table'!$I$8,\"Yes\",\"NO\")","v":"Yes"}]
[null,null,null,null,null,null,null,null,null,null,null,null,0,{"$error":"#VALUE!"},{"$error":"#VALUE!"},0,{"$error":"#VALUE!"},{"$error":"#VALUE!"},0,{"$error":"#VALUE!"},{"$f":"IF(S775<='Collection System Summary_Table'!$I$8,\"Yes\",\"NO\")","v":"Yes"}]
[null,null,null,null,null,null,null,null,null,null,null,null,0,{"$error":"#VALUE!"},{"$error":"#VALUE!"},0,{"$error":"#VALUE!"},{"$error":"#VALUE!"},0,{"$error":"#VALUE!"},{"$f":"IF(S776<='Collection System Summary_Table'!$I$8,\"Yes\",\"NO\")","v":"Yes"}]
[null,null,null,null,null,null,null,null,null,null,null,null,0,{"$error":"#VALUE!"},{"$error":"#VALUE!"},0,{"$error":"#VALUE!"},{"$error":"#VALUE!"},0,{"$error":"#VALUE!"},{"$f":"IF(S777<='Collection System Summary_Table'!$I$8,\"Yes\",\"NO\")","v":"Yes"}]
[null,null,null,null,null,null,null,null,null,null,null,null,0,{"$error":"#VALUE!"},{"$error":"#VALUE!"},0,{"$error":"#VALUE!"},{"$error":"#VALUE!"},0,{"$error":"#VALUE!"},{"$f":"IF(S778<='Collection System Summary_Table'!$I$8,\"Yes\",\"NO\")","v":"Yes"}]
[null,null,null,null,null,null,null,null,null,null,null,null,0,{"$error":"#VALUE!"},{"$error":"#VALUE!"},0,{"$error":"#VALUE!"},{"$error":"#VALUE!"},0,{"$error":"#VALUE!"},{"$f":"IF(S779<='Collection System Summary_Table'!$I$8,\"Yes\",\"NO\")","v":"Yes"}]
[null,null,null,null,null,null,null,null,null,null,null,null,0,{"$error":"#VALUE!"},{"$error":"#VALUE!"},0,{"$error":"#VALUE!"},{"$error":"#VALUE!"},0,{"$error":"#VALUE!"},{"$f":"IF(S780<='Collection System Summary_Table'!$I$8,\"Yes\",\"NO\")","v":"Yes"}]
[null,null,null,null,null,null,null,null,null,null,null,null,0,{"$error":"#VALUE!"},{"$error":"#VALUE!"},0,{"$error":"#VALUE!"},{"$error":"#VALUE!"},0,{"$error":"#VALUE!"},{"$f":"IF(S781<='Collection System Summary_Table'!$I$8,\"Yes\",\"NO\")","v":"Yes"}]
[null,null,null,null,null,null,null,null,null,null,null,null,0,{"$error":"#VALUE!"},{"$error":"#VALUE!"},0,{"$error":"#VALUE!"},{"$error":"#VALUE!"},0,{"$error":"#VALUE!"},{"$f":"IF(S782<='Collection System Summary_Table'!$I$8,\"Yes\",\"NO\")","v":"Yes"}]
[null,null,null,null,null,null,null,null,null,null,null,null,0,{"$error":"#VALUE!"},{"$error":"#VALUE!"},0,{"$error":"#VALUE!"},{"$error":"#VALUE!"},0,{"$error":"#VALUE!"},{"$f":"IF(S783<='Collection System Summary_Table'!$I$8,\"Yes\",\"NO\")","v":"Yes"}]
[null,null,null,null,null,null,null,null,null,null,null,null,0,{"$error":"#VALUE!"},{"$error":"#VALUE!"},0,{"$error":"#VALUE!"},{"$error":"#VALUE!"},0,{"$error":"#VALUE!"},{"$f":"IF(S784<='Collection System Summary_Table'!$I$8,\"Yes\",\"NO\")","v":"Yes"}]
[null,null,null,null,null,null,null,null,null,null,null,null,0,{"$error":"#VALUE!"},{"$error":"#VALUE!"},0,{"$error":"#VALUE!"},{"$error":"#VALUE!"},0,{"$error":"#VALUE!"},{"$f":"IF(S785<='Collection System Summary_Table'!$I$8,\"Yes\",\"NO\")","v":"Yes"}]
[null,null,null,null,null,null,null,null,null,null,null,null,0,{"$error":"#VALUE!"},{"$error":"#VALUE!"},0,{"$error":"#VALUE!"},{"$error":"#VALUE!"},0,{"$error":"#VALUE!"},{"$f":"IF(S786<='Collection System Summary_Table'!$I$8,\"Yes\",\"NO\")","v":"Yes"}]
[null,null,null,null,null,null,null,null,null,null,null,null,0,{"$error":"#VALUE!"},{"$error":"#VALUE!"},0,{"$error":"#VALUE!"},{"$error":"#VALUE!"},0,{"$error":"#VALUE!"},{"$f":"IF(S787<='Collection System Summary_Table'!$I$8,\"Yes\",\"NO\")","v":"Yes"}]
[null,null,null,null,null,null,null,null,null,null,null,null,0,{"$error":"#VALUE!"},{"$error":"#VALUE!"},0,{"$error":"#VALUE!"},{"$error":"#VALUE!"},0,{"$error":"#VALUE!"},{"$f":"IF(S788<='Collection System Summary_Table'!$I$8,\"Yes\",\"NO\")","v":"Yes"}]
[null,null,null,null,null,null,null,null,null,null,null,null,0,{"$error":"#VALUE!"},{"$error":"#VALUE!"},0,{"$error":"#VALUE!"},{"$error":"#VALUE!"},0,{"$error":"#VALUE!"},{"$f":"IF(S789<='Collection System Summary_Table'!$I$8,\"Yes\",\"NO\")","v":"Yes"}]
[null,null,null,null,null,null,null,null,null,null,null,null,0,{"$error":"#VALUE!"},{"$error":"#VALUE!"},0,{"$error":"#VALUE!"},{"$error":"#VALUE!"},0,{"$error":"#VALUE!"},{"$f":"IF(S790<='Collection System Summary_Table'!$I$8,\"Yes\",\"NO\")","v":"Yes"}]
[null,null,null,null,null,null,null,null,null,null,null,null,0,{"$error":"#VALUE!"},{"$error":"#VALUE!"},0,{"$error":"#VALUE!"},{"$error":"#VALUE!"},0,{"$error":"#VALUE!"},{"$f":"IF(S791<='Collection System Summary_Table'!$I$8,\"Yes\",\"NO\")","v":"Yes"}]
[null,null,null,null,null,null,null,null,null,null,null,null,0,{"$error":"#VALUE!"},{"$error":"#VALUE!"},0,{"$error":"#VALUE!"},{"$error":"#VALUE!"},0,{"$error":"#VALUE!"},{"$f":"IF(S792<='Collection System Summary_Table'!$I$8,\"Yes\",\"NO\")","v":"Yes"}]
[null,null,null,null,null,null,null,null,null,null,null,null,0,{"$error":"#VALUE!"},{"$error":"#VALUE!"},0,{"$error":"#VALUE!"},{"$error":"#VALUE!"},0,{"$error":"#VALUE!"},{"$f":"IF(S793<='Collection System Summary_Table'!$I$8,\"Yes\",\"NO\")","v":"Yes"}]
[null,null,null,null,null,null,null,null,null,null,null,null,0,{"$error":"#VALUE!"},{"$error":"#VALUE!"},0,{"$error":"#VALUE!"},{"$error":"#VALUE!"},0,{"$error":"#VALUE!"},{"$f":"IF(S794<='Collection System Summary_Table'!$I$8,\"Yes\",\"NO\")","v":"Yes"}]
[null,null,null,null,null,null,null,null,null,null,null,null,0,{"$error":"#VALUE!"},{"$error":"#VALUE!"},0,{"$error":"#VALUE!"},{"$error":"#VALUE!"},0,{"$error":"#VALUE!"},{"$f":"IF(S795<='Collection System Summary_Table'!$I$8,\"Yes\",\"NO\")","v":"Yes"}]
[null,null,null,null,null,null,null,null,null,null,null,null,0,{"$error":"#VALUE!"},{"$error":"#VALUE!"},0,{"$error":"#VALUE!"},{"$error":"#VALUE!"},0,{"$error":"#VALUE!"},{"$f":"IF(S796<='Collection System Summary_Table'!$I$8,\"Yes\",\"NO\")","v":"Yes"}]
[null,null,null,null,null,null,null,null,null,null,null,null,0,{"$error":"#VALUE!"},{"$error":"#VALUE!"},0,{"$error":"#VALUE!"},{"$error":"#VALUE!"},0,{"$error":"#VALUE!"},{"$f":"IF(S797<='Collection System Summary_Table'!$I$8,\"Yes\",\"NO\")","v":"Yes"}]
[null,null,null,null,null,null,null,null,null,null,null,null,0,{"$error":"#VALUE!"},{"$error":"#VALUE!"},0,{"$error":"#VALUE!"},{"$error":"#VALUE!"},0,{"$error":"#VALUE!"},{"$f":"IF(S798<='Collection System Summary_Table'!$I$8,\"Yes\",\"NO\")","v":"Yes"}]
[null,null,null,null,null,null,null,null,null,null,null,null,0,{"$error":"#VALUE!"},{"$error":"#VALUE!"},0,{"$error":"#VALUE!"},{"$error":"#VALUE!"},0,{"$error":"#VALUE!"},{"$f":"IF(S799<='Collection System Summary_Table'!$I$8,\"Yes\",\"NO\")","v":"Yes"}]
[null,null,null,null,null,null,null,null,null,null,null,null,0,{"$error":"#VALUE!"},{"$error":"#VALUE!"},0,{"$error":"#VALUE!"},{"$error":"#VALUE!"},0,{"$error":"#VALUE!"},{"$f":"IF(S800<='Collection System Summary_Table'!$I$8,\"Yes\",\"NO\")","v":"Yes"}]
[null,null,null,null,null,null,null,null,null,null,null,null,0,{"$error":"#VALUE!"},{"$error":"#VALUE!"},0,{"$error":"#VALUE!"},{"$error":"#VALUE!"},0,{"$error":"#VALUE!"},{"$f":"IF(S801<='Collection System Summary_Table'!$I$8,\"Yes\",\"NO\")","v":"Yes"}]
[null,null,null,null,null,null,null,null,null,null,null,null,0,{"$error":"#VALUE!"},{"$error":"#VALUE!"},0,{"$error":"#VALUE!"},{"$error":"#VALUE!"},0,{"$error":"#VALUE!"},{"$f":"IF(S802<='Collection System Summary_Table'!$I$8,\"Yes\",\"NO\")","v":"Yes"}]
[null,null,null,null,null,null,null,null,null,null,null,null,0,{"$error":"#VALUE!"},{"$error":"#VALUE!"},0,{"$error":"#VALUE!"},{"$error":"#VALUE!"},0,{"$error":"#VALUE!"},{"$f":"IF(S803<='Collection System Summary_Table'!$I$8,\"Yes\",\"NO\")","v":"Yes"}]
[null,null,null,null,null,null,null,null,null,null,null,null,0,{"$error":"#VALUE!"},{"$error":"#VALUE!"},0,{"$error":"#VALUE!"},{"$error":"#VALUE!"},0,{"$error":"#VALUE!"},{"$f":"IF(S804<='Collection System Summary_Table'!$I$8,\"Yes\",\"NO\")","v":"Yes"}]
[null,null,null,null,null,null,null,null,null,null,null,null,0,{"$error":"#VALUE!"},{"$error":"#VALUE!"},0,{"$error":"#VALUE!"},{"$error":"#VALUE!"},0,{"$error":"#VALUE!"},{"$f":"IF(S805<='Collection System Summary_Table'!$I$8,\"Yes\",\"NO\")","v":"Yes"}]
[null,null,null,null,null,null,null,null,null,null,null,null,0,{"$error":"#VALUE!"},{"$error":"#VALUE!"},0,{"$error":"#VALUE!"},{"$error":"#VALUE!"},0,{"$error":"#VALUE!"},{"$f":"IF(S806<='Collection System Summary_Table'!$I$8,\"Yes\",\"NO\")","v":"Yes"}]
[null,null,null,null,null,null,null,null,null,null,null,null,0,{"$error":"#VALUE!"},{"$error":"#VALUE!"},0,{"$error":"#VALUE!"},{"$error":"#VALUE!"},0,{"$error":"#VALUE!"},{"$f":"IF(S807<='Collection System Summary_Table'!$I$8,\"Yes\",\"NO\")","v":"Yes"}]
[null,null,null,null,null,null,null,null,null,null,null,null,0,{"$error":"#VALUE!"},{"$error":"#VALUE!"},0,{"$error":"#VALUE!"},{"$error":"#VALUE!"},0,{"$error":"#VALUE!"},{"$f":"IF(S808<='Collection System Summary_Table'!$I$8,\"Yes\",\"NO\")","v":"Yes"}]
[null,null,null,null,null,null,null,null,null,null,null,null,0,{"$error":"#VALUE!"},{"$error":"#VALUE!"},0,{"$error":"#VALUE!"},{"$error":"#VALUE!"},0,{"$error":"#VALUE!"},{"$f":"IF(S809<='Collection System Summary_Table'!$I$8,\"Yes\",\"NO\")","v":"Yes"}]
[null,null,null,null,null,null,null,null,null,null,null,null,0,{"$error":"#VALUE!"},{"$error":"#VALUE!"},0,{"$error":"#VALUE!"},{"$error":"#VALUE!"},0,{"$error":"#VALUE!"},{"$f":"IF(S810<='Collection System Summary_Table'!$I$8,\"Yes\",\"NO\")","v":"Yes"}]
[null,null,null,null,null,null,null,null,null,null,null,null,0,{"$error":"#VALUE!"},{"$error":"#VALUE!"},0,{"$error":"#VALUE!"},{"$error":"#VALUE!"},0,{"$error":"#VALUE!"},{"$f":"IF(S811<='Collection System Summary_Table'!$I$8,\"Yes\",\"NO\")","v":"Yes"}]
[null,null,null,null,null,null,null,null,null,null,null,null,0,{"$error":"#VALUE!"},{"$error":"#VALUE!"},0,{"$error":"#VALUE!"},{"$error":"#VALUE!"},0,{"$error":"#VALUE!"},{"$f":"IF(S812<='Collection System Summary_Table'!$I$8,\"Yes\",\"NO\")","v":"Yes"}]
[null,null,null,null,null,null,null,null,null,null,null,null,0,{"$error":"#VALUE!"},{"$error":"#VALUE!"},0,{"$error":"#VALUE!"},{"$error":"#VALUE!"},0,{"$error":"#VALUE!"},{"$f":"IF(S813<='Collection System Summary_Table'!$I$8,\"Yes\",\"NO\")","v":"Yes"}]
[null,null,null,null,null,null,null,null,null,null,null,null,0,{"$error":"#VALUE!"},{"$error":"#VALUE!"},0,{"$error":"#VALUE!"},{"$error":"#VALUE!"},0,{"$error":"#VALUE!"},{"$f":"IF(S814<='Collection System Summary_Table'!$I$8,\"Yes\",\"NO\")","v":"Yes"}]
[null,null,null,null,null,null,null,null,null,null,null,null,0,{"$error":"#VALUE!"},{"$error":"#VALUE!"},0,{"$error":"#VALUE!"},{"$error":"#VALUE!"},0,{"$error":"#VALUE!"},{"$f":"IF(S815<='Collection System Summary_Table'!$I$8,\"Yes\",\"NO\")","v":"Yes"}]
[null,null,null,null,null,null,null,null,null,null,null,null,0,{"$error":"#VALUE!"},{"$error":"#VALUE!"},0,{"$error":"#VALUE!"},{"$error":"#VALUE!"},0,{"$error":"#VALUE!"},{"$f":"IF(S816<='Collection System Summary_Table'!$I$8,\"Yes\",\"NO\")","v":"Yes"}]
[null,null,null,null,null,null,null,null,null,null,null,null,0,{"$error":"#VALUE!"},{"$error":"#VALUE!"},0,{"$error":"#VALUE!"},{"$error":"#VALUE!"},0,{"$error":"#VALUE!"},{"$f":"IF(S817<='Collection System Summary_Table'!$I$8,\"Yes\",\"NO\")","v":"Yes"}]
[null,null,null,null,null,null,null,null,null,null,null,null,0,{"$error":"#VALUE!"},{"$error":"#VALUE!"},0,{"$error":"#VALUE!"},{"$error":"#VALUE!"},0,{"$error":"#VALUE!"},{"$f":"IF(S818<='Collection System Summary_Table'!$I$8,\"Yes\",\"NO\")","v":"Yes"}]
[null,null,null,null,null,null,null,null,null,null,null,null,0,{"$error":"#VALUE!"},{"$error":"#VALUE!"},0,{"$error":"#VALUE!"},{"$error":"#VALUE!"},0,{"$error":"#VALUE!"},{"$f":"IF(S819<='Collection System Summary_Table'!$I$8,\"Yes\",\"NO\")","v":"Yes"}]
[null,null,null,null,null,null,null,null,null,null,null,null,0,{"$error":"#VALUE!"},{"$error":"#VALUE!"},0,{"$error":"#VALUE!"},{"$error":"#VALUE!"},0,{"$error":"#VALUE!"},{"$f":"IF(S820<='Collection System Summary_Table'!$I$8,\"Yes\",\"NO\")","v":"Yes"}]
[null,null,null,null,null,null,null,null,null,null,null,null,0,{"$error":"#VALUE!"},{"$error":"#VALUE!"},0,{"$error":"#VALUE!"},{"$error":"#VALUE!"},0,{"$error":"#VALUE!"},{"$f":"IF(S821<='Collection System Summary_Table'!$I$8,\"Yes\",\"NO\")","v":"Yes"}]
[null,null,null,null,null,null,null,null,null,null,null,null,0,{"$error":"#VALUE!"},{"$error":"#VALUE!"},0,{"$error":"#VALUE!"},{"$error":"#VALUE!"},0,{"$error":"#VALUE!"},{"$f":"IF(S822<='Collection System Summary_Table'!$I$8,\"Yes\",\"NO\")","v":"Yes"}]
[null,null,null,null,null,null,null,null,null,null,null,null,0,{"$error":"#VALUE!"},{"$error":"#VALUE!"},0,{"$error":"#VALUE!"},{"$error":"#VALUE!"},0,{"$error":"#VALUE!"},{"$f":"IF(S823<='Collection System Summary_Table'!$I$8,\"Yes\",\"NO\")","v":"Yes"}]
[null,null,null,null,null,null,null,null,null,null,null,null,0,{"$error":"#VALUE!"},{"$error":"#VALUE!"},0,{"$error":"#VALUE!"},{"$error":"#VALUE!"},0,{"$error":"#VALUE!"},{"$f":"IF(S824<='Collection System Summary_Table'!$I$8,\"Yes\",\"NO\")","v":"Yes"}]
[null,null,null,null,null,null,null,null,null,null,null,null,0,{"$error":"#VALUE!"},{"$error":"#VALUE!"},0,{"$error":"#VALUE!"},{"$error":"#VALUE!"},0,{"$error":"#VALUE!"},{"$f":"IF(S825<='Collection System Summary_Table'!$I$8,\"Yes\",\"NO\")","v":"Yes"}]
[null,null,null,null,null,null,null,null,null,null,null,null,0,{"$error":"#VALUE!"},{"$error":"#VALUE!"},0,{"$error":"#VALUE!"},{"$error":"#VALUE!"},0,{"$error":"#VALUE!"},{"$f":"IF(S826<='Collection System Summary_Table'!$I$8,\"Yes\",\"NO\")","v":"Yes"}]
[null,null,null,null,null,null,null,null,null,null,null,null,0,{"$error":"#VALUE!"},{"$error":"#VALUE!"},0,{"$error":"#VALUE!"},{"$error":"#VALUE!"},0,{"$error":"#VALUE!"},{"$f":"IF(S827<='Collection System Summary_Table'!$I$8,\"Yes\",\"NO\")","v":"Yes"}]
[null,null,null,null,null,null,null,null,null,null,null,null,0,{"$error":"#VALUE!"},{"$error":"#VALUE!"},0,{"$error":"#VALUE!"},{"$error":"#VALUE!"},0,{"$error":"#VALUE!"},{"$f":"IF(S828<='Collection System Summary_Table'!$I$8,\"Yes\",\"NO\")","v":"Yes"}]
[null,null,null,null,null,null,null,null,null,null,null,null,0,{"$error":"#VALUE!"},{"$error":"#VALUE!"},0,{"$error":"#VALUE!"},{"$error":"#VALUE!"},0,{"$error":"#VALUE!"},{"$f":"IF(S829<='Collection System Summary_Table'!$I$8,\"Yes\",\"NO\")","v":"Yes"}]
[null,null,null,null,null,null,null,null,null,null,null,null,0,{"$error":"#VALUE!"},{"$error":"#VALUE!"},0,{"$error":"#VALUE!"},{"$error":"#VALUE!"},0,{"$error":"#VALUE!"},{"$f":"IF(S830<='Collection System Summary_Table'!$I$8,\"Yes\",\"NO\")","v":"Yes"}]
[null,null,null,null,null,null,null,null,null,null,null,null,0,{"$error":"#VALUE!"},{"$error":"#VALUE!"},0,{"$error":"#VALUE!"},{"$error":"#VALUE!"},0,{"$error":"#VALUE!"},{"$f":"IF(S831<='Collection System Summary_Table'!$I$8,\"Yes\",\"NO\")","v":"Yes"}]
[null,null,null,null,null,null,null,null,null,null,null,null,0,{"$error":"#VALUE!"},{"$error":"#VALUE!"},0,{"$error":"#VALUE!"},{"$error":"#VALUE!"},0,{"$error":"#VALUE!"},{"$f":"IF(S832<='Collection System Summary_Table'!$I$8,\"Yes\",\"NO\")","v":"Yes"}]
[null,null,null,null,null,null,null,null,null,null,null,null,0,{"$error":"#VALUE!"},{"$error":"#VALUE!"},0,{"$error":"#VALUE!"},{"$error":"#VALUE!"},0,{"$error":"#VALUE!"},{"$f":"IF(S833<='Collection System Summary_Table'!$I$8,\"Yes\",\"NO\")","v":"Yes"}]
[null,null,null,null,null,null,null,null,null,null,null,null,0,{"$error":"#VALUE!"},{"$error":"#VALUE!"},0,{"$error":"#VALUE!"},{"$error":"#VALUE!"},0,{"$error":"#VALUE!"},{"$f":"IF(S834<='Collection System Summary_Table'!$I$8,\"Yes\",\"NO\")","v":"Yes"}]
[null,null,null,null,null,null,null,null,null,null,null,null,0,{"$f":"IF(P835=0,I835+N834,0)","v":{"$error":"#VALUE!"}},{"$error":"#VALUE!"},0,{"$error":"#VALUE!"},{"$error":"#VALUE!"},0,{"$error":"#VALUE!"},{"$f":"IF(S835<='Collection System Summary_Table'!$I$8,\"Yes\",\"NO\")","v":"Yes"}]
[null,null,null,null,null,null,null,null,null,null,null,null,0,{"$error":"#VALUE!"},{"$f":"IF(AND(Q836=0,P836=0),K836+O835,0)","v":{"$error":"#VALUE!"}},0,{"$f":"IF(AND(P836=0,N836<($B$4+$P$1)),J836,0)","v":{"$error":"#VALUE!"}},{"$f":"IF(AND(P836=0,Q836=0,O836<($B$5+$Q$1)),K836,0)","v":{"$error":"#VALUE!"}},{"$f":"S835+L836","v":0},{"$f":"IF(OR(P836>1,Q836>1,R836>1),\"YES\",\"NO\")","v":{"$error":"#VALUE!"}},{"$f":"IF(S836<='Collection System Summary_Table'!$I$8,\"Yes\",\"NO\")","v":"Yes"}]
[null,null,null,null,null,null,null,null,null,null,null,null,{"$f":"M836+I837","v":0},{"$error":"#VALUE!"},{"$error":"#VALUE!"},{"$f":"IF(M837<=$B$3,I837,0)","v":0},{"$error":"#VALUE!"},{"$error":"#VALUE!"},0,{"$error":"#VALUE!"},{"$f":"IF(S837<='Collection System Summary_Table'!$I$8,\"Yes\",\"NO\")","v":"Yes"}]
[null,null,null,null,null,null,null,null,null,null,null,null,0,{"$error":"#VALUE!"},{"$error":"#VALUE!"},0,{"$error":"#VALUE!"},{"$error":"#VALUE!"},0,{"$error":"#VALUE!"},{"$f":"IF(S838<='Collection System Summary_Table'!$I$8,\"Yes\",\"NO\")","v":"Yes"}]
[null,null,null,null,null,null,null,null,null,null,null,null,0,{"$error":"#VALUE!"},{"$error":"#VALUE!"},0,{"$error":"#VALUE!"},{"$error":"#VALUE!"},0,{"$error":"#VALUE!"},{"$f":"IF(S839<='Collection System Summary_Table'!$I$8,\"Yes\",\"NO\")","v":"Yes"}]
[null,null,null,null,null,null,null,null,null,null,null,null,0,{"$error":"#VALUE!"},{"$error":"#VALUE!"},0,{"$error":"#VALUE!"},{"$error":"#VALUE!"},0,{"$error":"#VALUE!"},{"$f":"IF(S840<='Collection System Summary_Table'!$I$8,\"Yes\",\"NO\")","v":"Yes"}]
[null,null,null,null,null,null,null,null,null,null,null,null,0,{"$error":"#VALUE!"},{"$error":"#VALUE!"},0,{"$error":"#VALUE!"},{"$error":"#VALUE!"},0,{"$error":"#VALUE!"},{"$f":"IF(S841<='Collection System Summary_Table'!$I$8,\"Yes\",\"NO\")","v":"Yes"}]
[null,null,null,null,null,null,null,null,null,null,null,null,0,{"$error":"#VALUE!"},{"$error":"#VALUE!"},0,{"$error":"#VALUE!"},{"$error":"#VALUE!"},0,{"$error":"#VALUE!"},{"$f":"IF(S842<='Collection System Summary_Table'!$I$8,\"Yes\",\"NO\")","v":"Yes"}]
[null,null,null,null,null,null,null,null,null,null,null,null,0,{"$error":"#VALUE!"},{"$error":"#VALUE!"},0,{"$error":"#VALUE!"},{"$error":"#VALUE!"},0,{"$error":"#VALUE!"},{"$f":"IF(S843<='Collection System Summary_Table'!$I$8,\"Yes\",\"NO\")","v":"Yes"}]
[null,null,null,null,null,null,null,null,null,null,null,null,0,{"$error":"#VALUE!"},{"$error":"#VALUE!"},0,{"$error":"#VALUE!"},{"$error":"#VALUE!"},0,{"$error":"#VALUE!"},{"$f":"IF(S844<='Collection System Summary_Table'!$I$8,\"Yes\",\"NO\")","v":"Yes"}]
[null,null,null,null,null,null,null,null,null,null,null,null,0,{"$error":"#VALUE!"},{"$error":"#VALUE!"},0,{"$error":"#VALUE!"},{"$error":"#VALUE!"},0,{"$error":"#VALUE!"},{"$f":"IF(S845<='Collection System Summary_Table'!$I$8,\"Yes\",\"NO\")","v":"Yes"}]
[null,null,null,null,null,null,null,null,null,null,null,null,0,{"$error":"#VALUE!"},{"$error":"#VALUE!"},0,{"$error":"#VALUE!"},{"$error":"#VALUE!"},0,{"$error":"#VALUE!"},{"$f":"IF(S846<='Collection System Summary_Table'!$I$8,\"Yes\",\"NO\")","v":"Yes"}]
[null,null,null,null,null,null,null,null,null,null,null,null,0,{"$error":"#VALUE!"},{"$error":"#VALUE!"},0,{"$error":"#VALUE!"},{"$error":"#VALUE!"},0,{"$error":"#VALUE!"},{"$f":"IF(S847<='Collection System Summary_Table'!$I$8,\"Yes\",\"NO\")","v":"Yes"}]
[null,null,null,null,null,null,null,null,null,null,null,null,0,{"$error":"#VALUE!"},{"$error":"#VALUE!"},0,{"$error":"#VALUE!"},{"$error":"#VALUE!"},0,{"$error":"#VALUE!"},{"$f":"IF(S848<='Collection System Summary_Table'!$I$8,\"Yes\",\"NO\")","v":"Yes"}]
[null,null,null,null,null,null,null,null,null,null,null,null,0,{"$error":"#VALUE!"},{"$error":"#VALUE!"},0,{"$error":"#VALUE!"},{"$error":"#VALUE!"},0,{"$error":"#VALUE!"},{"$f":"IF(S849<='Collection System Summary_Table'!$I$8,\"Yes\",\"NO\")","v":"Yes"}]
[null,null,null,null,null,null,null,null,null,null,null,null,0,{"$error":"#VALUE!"},{"$error":"#VALUE!"},0,{"$error":"#VALUE!"},{"$error":"#VALUE!"},0,{"$error":"#VALUE!"},{"$f":"IF(S850<='Collection System Summary_Table'!$I$8,\"Yes\",\"NO\")","v":"Yes"}]
[null,null,null,null,null,null,null,null,null,null,null,null,0,{"$error":"#VALUE!"},{"$error":"#VALUE!"},0,{"$error":"#VALUE!"},{"$error":"#VALUE!"},0,{"$error":"#VALUE!"},{"$f":"IF(S851<='Collection System Summary_Table'!$I$8,\"Yes\",\"NO\")","v":"Yes"}]
[null,null,null,null,null,null,null,null,null,null,null,null,0,{"$error":"#VALUE!"},{"$error":"#VALUE!"},0,{"$error":"#VALUE!"},{"$error":"#VALUE!"},0,{"$error":"#VALUE!"},{"$f":"IF(S852<='Collection System Summary_Table'!$I$8,\"Yes\",\"NO\")","v":"Yes"}]
[null,null,null,null,null,null,null,null,null,null,null,null,0,{"$error":"#VALUE!"},{"$error":"#VALUE!"},0,{"$error":"#VALUE!"},{"$error":"#VALUE!"},0,{"$error":"#VALUE!"},{"$f":"IF(S853<='Collection System Summary_Table'!$I$8,\"Yes\",\"NO\")","v":"Yes"}]
[null,null,null,null,null,null,null,null,null,null,null,null,0,{"$error":"#VALUE!"},{"$error":"#VALUE!"},0,{"$error":"#VALUE!"},{"$error":"#VALUE!"},0,{"$error":"#VALUE!"},{"$f":"IF(S854<='Collection System Summary_Table'!$I$8,\"Yes\",\"NO\")","v":"Yes"}]
[null,null,null,null,null,null,null,null,null,null,null,null,0,{"$error":"#VALUE!"},{"$error":"#VALUE!"},0,{"$error":"#VALUE!"},{"$error":"#VALUE!"},0,{"$error":"#VALUE!"},{"$f":"IF(S855<='Collection System Summary_Table'!$I$8,\"Yes\",\"NO\")","v":"Yes"}]
[null,null,null,null,null,null,null,null,null,null,null,null,0,{"$error":"#VALUE!"},{"$error":"#VALUE!"},0,{"$error":"#VALUE!"},{"$error":"#VALUE!"},0,{"$error":"#VALUE!"},{"$f":"IF(S856<='Collection System Summary_Table'!$I$8,\"Yes\",\"NO\")","v":"Yes"}]
[null,null,null,null,null,null,null,null,null,null,null,null,0,{"$error":"#VALUE!"},{"$error":"#VALUE!"},0,{"$error":"#VALUE!"},{"$error":"#VALUE!"},0,{"$error":"#VALUE!"},{"$f":"IF(S857<='Collection System Summary_Table'!$I$8,\"Yes\",\"NO\")","v":"Yes"}]
[null,null,null,null,null,null,null,null,null,null,null,null,0,{"$error":"#VALUE!"},{"$error":"#VALUE!"},0,{"$error":"#VALUE!"},{"$error":"#VALUE!"},0,{"$error":"#VALUE!"},{"$f":"IF(S858<='Collection System Summary_Table'!$I$8,\"Yes\",\"NO\")","v":"Yes"}]
[null,null,null,null,null,null,null,null,null,null,null,null,0,{"$error":"#VALUE!"},{"$error":"#VALUE!"},0,{"$error":"#VALUE!"},{"$error":"#VALUE!"},0,{"$error":"#VALUE!"},{"$f":"IF(S859<='Collection System Summary_Table'!$I$8,\"Yes\",\"NO\")","v":"Yes"}]
[null,null,null,null,null,null,null,null,null,null,null,null,0,{"$error":"#VALUE!"},{"$error":"#VALUE!"},0,{"$error":"#VALUE!"},{"$error":"#VALUE!"},0,{"$error":"#VALUE!"},{"$f":"IF(S860<='Collection System Summary_Table'!$I$8,\"Yes\",\"NO\")","v":"Yes"}]
[null,null,null,null,null,null,null,null,null,null,null,null,0,{"$error":"#VALUE!"},{"$error":"#VALUE!"},0,{"$error":"#VALUE!"},{"$error":"#VALUE!"},0,{"$error":"#VALUE!"},{"$f":"IF(S861<='Collection System Summary_Table'!$I$8,\"Yes\",\"NO\")","v":"Yes"}]
[null,null,null,null,null,null,null,null,null,null,null,null,0,{"$error":"#VALUE!"},{"$error":"#VALUE!"},0,{"$error":"#VALUE!"},{"$error":"#VALUE!"},0,{"$error":"#VALUE!"},{"$f":"IF(S862<='Collection System Summary_Table'!$I$8,\"Yes\",\"NO\")","v":"Yes"}]
[null,null,null,null,null,null,null,null,null,null,null,null,0,{"$error":"#VALUE!"},{"$error":"#VALUE!"},0,{"$error":"#VALUE!"},{"$error":"#VALUE!"},0,{"$error":"#VALUE!"},{"$f":"IF(S863<='Collection System Summary_Table'!$I$8,\"Yes\",\"NO\")","v":"Yes"}]
[null,null,null,null,null,null,null,null,null,null,null,null,0,{"$error":"#VALUE!"},{"$error":"#VALUE!"},0,{"$error":"#VALUE!"},{"$error":"#VALUE!"},0,{"$error":"#VALUE!"},{"$f":"IF(S864<='Collection System Summary_Table'!$I$8,\"Yes\",\"NO\")","v":"Yes"}]
[null,null,null,null,null,null,null,null,null,null,null,null,0,{"$error":"#VALUE!"},{"$error":"#VALUE!"},0,{"$error":"#VALUE!"},{"$error":"#VALUE!"},0,{"$error":"#VALUE!"},{"$f":"IF(S865<='Collection System Summary_Table'!$I$8,\"Yes\",\"NO\")","v":"Yes"}]
[null,null,null,null,null,null,null,null,null,null,null,null,0,{"$error":"#VALUE!"},{"$error":"#VALUE!"},0,{"$error":"#VALUE!"},{"$error":"#VALUE!"},0,{"$error":"#VALUE!"},{"$f":"IF(S866<='Collection System Summary_Table'!$I$8,\"Yes\",\"NO\")","v":"Yes"}]
[null,null,null,null,null,null,null,null,null,null,null,null,0,{"$error":"#VALUE!"},{"$error":"#VALUE!"},0,{"$error":"#VALUE!"},{"$error":"#VALUE!"},0,{"$error":"#VALUE!"},{"$f":"IF(S867<='Collection System Summary_Table'!$I$8,\"Yes\",\"NO\")","v":"Yes"}]
[null,null,null,null,null,null,null,null,null,null,null,null,0,{"$error":"#VALUE!"},{"$error":"#VALUE!"},0,{"$error":"#VALUE!"},{"$error":"#VALUE!"},0,{"$error":"#VALUE!"},{"$f":"IF(S868<='Collection System Summary_Table'!$I$8,\"Yes\",\"NO\")","v":"Yes"}]
[null,null,null,null,null,null,null,null,null,null,null,null,0,{"$error":"#VALUE!"},{"$error":"#VALUE!"},0,{"$error":"#VALUE!"},{"$error":"#VALUE!"},0,{"$error":"#VALUE!"},{"$f":"IF(S869<='Collection System Summary_Table'!$I$8,\"Yes\",\"NO\")","v":"Yes"}]
[null,null,null,null,null,null,null,null,null,null,null,null,0,{"$error":"#VALUE!"},{"$error":"#VALUE!"},0,{"$error":"#VALUE!"},{"$error":"#VALUE!"},0,{"$error":"#VALUE!"},{"$f":"IF(S870<='Collection System Summary_Table'!$I$8,\"Yes\",\"NO\")","v":"Yes"}]
[null,null,null,null,null,null,null,null,null,null,null,null,0,{"$error":"#VALUE!"},{"$error":"#VALUE!"},0,{"$error":"#VALUE!"},{"$error":"#VALUE!"},0,{"$error":"#VALUE!"},{"$f":"IF(S871<='Collection System Summary_Table'!$I$8,\"Yes\",\"NO\")","v":"Yes"}]
[null,null,null,null,null,null,null,null,null,null,null,null,0,{"$error":"#VALUE!"},{"$error":"#VALUE!"},0,{"$error":"#VALUE!"},{"$error":"#VALUE!"},0,{"$error":"#VALUE!"},{"$f":"IF(S872<='Collection System Summary_Table'!$I$8,\"Yes\",\"NO\")","v":"Yes"}]
[null,null,null,null,null,null,null,null,null,null,null,null,0,{"$error":"#VALUE!"},{"$error":"#VALUE!"},0,{"$error":"#VALUE!"},{"$error":"#VALUE!"},0,{"$error":"#VALUE!"},{"$f":"IF(S873<='Collection System Summary_Table'!$I$8,\"Yes\",\"NO\")","v":"Yes"}]
[null,null,null,null,null,null,null,null,null,null,null,null,0,{"$error":"#VALUE!"},{"$error":"#VALUE!"},0,{"$error":"#VALUE!"},{"$error":"#VALUE!"},0,{"$error":"#VALUE!"},{"$f":"IF(S874<='Collection System Summary_Table'!$I$8,\"Yes\",\"NO\")","v":"Yes"}]
[null,null,null,null,null,null,null,null,null,null,null,null,0,{"$error":"#VALUE!"},{"$error":"#VALUE!"},0,{"$error":"#VALUE!"},{"$error":"#VALUE!"},0,{"$error":"#VALUE!"},{"$f":"IF(S875<='Collection System Summary_Table'!$I$8,\"Yes\",\"NO\")","v":"Yes"}]
[null,null,null,null,null,null,null,null,null,null,null,null,0,{"$error":"#VALUE!"},{"$error":"#VALUE!"},0,{"$error":"#VALUE!"},{"$error":"#VALUE!"},0,{"$error":"#VALUE!"},{"$f":"IF(S876<='Collection System Summary_Table'!$I$8,\"Yes\",\"NO\")","v":"Yes"}]
[null,null,null,null,null,null,null,null,null,null,null,null,0,{"$error":"#VALUE!"},{"$error":"#VALUE!"},0,{"$error":"#VALUE!"},{"$error":"#VALUE!"},0,{"$error":"#VALUE!"},{"$f":"IF(S877<='Collection System Summary_Table'!$I$8,\"Yes\",\"NO\")","v":"Yes"}]
[null,null,null,null,null,null,null,null,null,null,null,null,0,{"$error":"#VALUE!"},{"$error":"#VALUE!"},0,{"$error":"#VALUE!"},{"$error":"#VALUE!"},0,{"$error":"#VALUE!"},{"$f":"IF(S878<='Collection System Summary_Table'!$I$8,\"Yes\",\"NO\")","v":"Yes"}]
[null,null,null,null,null,null,null,null,null,null,null,null,0,{"$error":"#VALUE!"},{"$error":"#VALUE!"},0,{"$error":"#VALUE!"},{"$error":"#VALUE!"},0,{"$error":"#VALUE!"},{"$f":"IF(S879<='Collection System Summary_Table'!$I$8,\"Yes\",\"NO\")","v":"Yes"}]
[null,null,null,null,null,null,null,null,null,null,null,null,0,{"$error":"#VALUE!"},{"$error":"#VALUE!"},0,{"$error":"#VALUE!"},{"$error":"#VALUE!"},0,{"$error":"#VALUE!"},{"$f":"IF(S880<='Collection System Summary_Table'!$I$8,\"Yes\",\"NO\")","v":"Yes"}]
[null,null,null,null,null,null,null,null,null,null,null,null,0,{"$error":"#VALUE!"},{"$error":"#VALUE!"},0,{"$error":"#VALUE!"},{"$error":"#VALUE!"},0,{"$error":"#VALUE!"},{"$f":"IF(S881<='Collection System Summary_Table'!$I$8,\"Yes\",\"NO\")","v":"Yes"}]
[null,null,null,null,null,null,null,null,null,null,null,null,0,{"$error":"#VALUE!"},{"$error":"#VALUE!"},0,{"$error":"#VALUE!"},{"$error":"#VALUE!"},0,{"$error":"#VALUE!"},{"$f":"IF(S882<='Collection System Summary_Table'!$I$8,\"Yes\",\"NO\")","v":"Yes"}]
[null,null,null,null,null,null,null,null,null,null,null,null,0,{"$error":"#VALUE!"},{"$error":"#VALUE!"},0,{"$error":"#VALUE!"},{"$error":"#VALUE!"},0,{"$error":"#VALUE!"},{"$f":"IF(S883<='Collection System Summary_Table'!$I$8,\"Yes\",\"NO\")","v":"Yes"}]
[null,null,null,null,null,null,null,null,null,null,null,null,0,{"$error":"#VALUE!"},{"$error":"#VALUE!"},0,{"$error":"#VALUE!"},{"$error":"#VALUE!"},0,{"$error":"#VALUE!"},{"$f":"IF(S884<='Collection System Summary_Table'!$I$8,\"Yes\",\"NO\")","v":"Yes"}]
[null,null,null,null,null,null,null,null,null,null,null,null,0,{"$error":"#VALUE!"},{"$error":"#VALUE!"},0,{"$error":"#VALUE!"},{"$error":"#VALUE!"},0,{"$error":"#VALUE!"},{"$f":"IF(S885<='Collection System Summary_Table'!$I$8,\"Yes\",\"NO\")","v":"Yes"}]
[null,null,null,null,null,null,null,null,null,null,null,null,0,{"$error":"#VALUE!"},{"$error":"#VALUE!"},0,{"$error":"#VALUE!"},{"$error":"#VALUE!"},0,{"$error":"#VALUE!"},{"$f":"IF(S886<='Collection System Summary_Table'!$I$8,\"Yes\",\"NO\")","v":"Yes"}]
[null,null,null,null,null,null,null,null,null,null,null,null,0,{"$error":"#VALUE!"},{"$error":"#VALUE!"},0,{"$error":"#VALUE!"},{"$error":"#VALUE!"},0,{"$error":"#VALUE!"},{"$f":"IF(S887<='Collection System Summary_Table'!$I$8,\"Yes\",\"NO\")","v":"Yes"}]
[null,null,null,null,null,null,null,null,null,null,null,null,0,{"$error":"#VALUE!"},{"$error":"#VALUE!"},0,{"$error":"#VALUE!"},{"$error":"#VALUE!"},0,{"$error":"#VALUE!"},{"$f":"IF(S888<='Collection System Summary_Table'!$I$8,\"Yes\",\"NO\")","v":"Yes"}]
[null,null,null,null,null,null,null,null,null,null,null,null,0,{"$error":"#VALUE!"},{"$error":"#VALUE!"},0,{"$error":"#VALUE!"},{"$error":"#VALUE!"},0,{"$error":"#VALUE!"},{"$f":"IF(S889<='Collection System Summary_Table'!$I$8,\"Yes\",\"NO\")","v":"Yes"}]
[null,null,null,null,null,null,null,null,null,null,null,null,0,{"$error":"#VALUE!"},{"$error":"#VALUE!"},0,{"$error":"#VALUE!"},{"$error":"#VALUE!"},0,{"$error":"#VALUE!"},{"$f":"IF(S890<='Collection System Summary_Table'!$I$8,\"Yes\",\"NO\")","v":"Yes"}]
[null,null,null,null,null,null,null,null,null,null,null,null,0,{"$error":"#VALUE!"},{"$error":"#VALUE!"},0,{"$error":"#VALUE!"},{"$error":"#VALUE!"},0,{"$error":"#VALUE!"},{"$f":"IF(S891<='Collection System Summary_Table'!$I$8,\"Yes\",\"NO\")","v":"Yes"}]
[null,null,null,null,null,null,null,null,null,null,null,null,0,{"$error":"#VALUE!"},{"$error":"#VALUE!"},0,{"$error":"#VALUE!"},{"$error":"#VALUE!"},0,{"$error":"#VALUE!"},{"$f":"IF(S892<='Collection System Summary_Table'!$I$8,\"Yes\",\"NO\")","v":"Yes"}]
[null,null,null,null,null,null,null,null,null,null,null,null,0,{"$error":"#VALUE!"},{"$error":"#VALUE!"},0,{"$error":"#VALUE!"},{"$error":"#VALUE!"},0,{"$error":"#VALUE!"},{"$f":"IF(S893<='Collection System Summary_Table'!$I$8,\"Yes\",\"NO\")","v":"Yes"}]
[null,null,null,null,null,null,null,null,null,null,null,null,0,{"$error":"#VALUE!"},{"$error":"#VALUE!"},0,{"$error":"#VALUE!"},{"$error":"#VALUE!"},0,{"$error":"#VALUE!"},{"$f":"IF(S894<='Collection System Summary_Table'!$I$8,\"Yes\",\"NO\")","v":"Yes"}]
[null,null,null,null,null,null,null,null,null,null,null,null,0,{"$error":"#VALUE!"},{"$error":"#VALUE!"},0,{"$error":"#VALUE!"},{"$error":"#VALUE!"},0,{"$error":"#VALUE!"},{"$f":"IF(S895<='Collection System Summary_Table'!$I$8,\"Yes\",\"NO\")","v":"Yes"}]
[null,null,null,null,null,null,null,null,null,null,null,null,0,{"$error":"#VALUE!"},{"$error":"#VALUE!"},0,{"$error":"#VALUE!"},{"$error":"#VALUE!"},0,{"$error":"#VALUE!"},{"$f":"IF(S896<='Collection System Summary_Table'!$I$8,\"Yes\",\"NO\")","v":"Yes"}]
[null,null,null,null,null,null,null,null,null,null,null,null,0,{"$error":"#VALUE!"},{"$error":"#VALUE!"},0,{"$error":"#VALUE!"},{"$error":"#VALUE!"},0,{"$error":"#VALUE!"},{"$f":"IF(S897<='Collection System Summary_Table'!$I$8,\"Yes\",\"NO\")","v":"Yes"}]
[null,null,null,null,null,null,null,null,null,null,null,null,0,{"$error":"#VALUE!"},{"$error":"#VALUE!"},0,{"$error":"#VALUE!"},{"$error":"#VALUE!"},0,{"$error":"#VALUE!"},{"$f":"IF(S898<='Collection System Summary_Table'!$I$8,\"Yes\",\"NO\")","v":"Yes"}]
[null,null,null,null,null,null,null,null,null,null,null,null,0,{"$f":"IF(P899=0,I899+N898,0)","v":{"$error":"#VALUE!"}},{"$error":"#VALUE!"},0,{"$error":"#VALUE!"},{"$error":"#VALUE!"},0,{"$error":"#VALUE!"},{"$f":"IF(S899<='Collection System Summary_Table'!$I$8,\"Yes\",\"NO\")","v":"Yes"}]
[null,null,null,null,null,null,null,null,null,null,null,null,0,{"$error":"#VALUE!"},{"$f":"IF(AND(Q900=0,P900=0),K900+O899,0)","v":{"$error":"#VALUE!"}},0,{"$f":"IF(AND(P900=0,N900<($B$4+$P$1)),J900,0)","v":{"$error":"#VALUE!"}},{"$f":"IF(AND(P900=0,Q900=0,O900<($B$5+$Q$1)),K900,0)","v":{"$error":"#VALUE!"}},{"$f":"S899+L900","v":0},{"$f":"IF(OR(P900>1,Q900>1,R900>1),\"YES\",\"NO\")","v":{"$error":"#VALUE!"}},{"$f":"IF(S900<='Collection System Summary_Table'!$I$8,\"Yes\",\"NO\")","v":"Yes"}]
[null,null,null,null,null,null,null,null,null,null,null,null,{"$f":"M900+I901","v":0},{"$error":"#VALUE!"},{"$error":"#VALUE!"},{"$f":"IF(M901<=$B$3,I901,0)","v":0},{"$error":"#VALUE!"},{"$error":"#VALUE!"},0,{"$error":"#VALUE!"},{"$f":"IF(S901<='Collection System Summary_Table'!$I$8,\"Yes\",\"NO\")","v":"Yes"}]
[null,null,null,null,null,null,null,null,null,null,null,null,0,{"$error":"#VALUE!"},{"$error":"#VALUE!"},0,{"$error":"#VALUE!"},{"$error":"#VALUE!"},0,{"$error":"#VALUE!"},{"$f":"IF(S902<='Collection System Summary_Table'!$I$8,\"Yes\",\"NO\")","v":"Yes"}]
[null,null,null,null,null,null,null,null,null,null,null,null,0,{"$error":"#VALUE!"},{"$error":"#VALUE!"},0,{"$error":"#VALUE!"},{"$error":"#VALUE!"},0,{"$error":"#VALUE!"},{"$f":"IF(S903<='Collection System Summary_Table'!$I$8,\"Yes\",\"NO\")","v":"Yes"}]
[null,null,null,null,null,null,null,null,null,null,null,null,0,{"$error":"#VALUE!"},{"$error":"#VALUE!"},0,{"$error":"#VALUE!"},{"$error":"#VALUE!"},0,{"$error":"#VALUE!"},{"$f":"IF(S904<='Collection System Summary_Table'!$I$8,\"Yes\",\"NO\")","v":"Yes"}]
[null,null,null,null,null,null,null,null,null,null,null,null,0,{"$error":"#VALUE!"},{"$error":"#VALUE!"},0,{"$error":"#VALUE!"},{"$error":"#VALUE!"},0,{"$error":"#VALUE!"},{"$f":"IF(S905<='Collection System Summary_Table'!$I$8,\"Yes\",\"NO\")","v":"Yes"}]
[null,null,null,null,null,null,null,null,null,null,null,null,0,{"$error":"#VALUE!"},{"$error":"#VALUE!"},0,{"$error":"#VALUE!"},{"$error":"#VALUE!"},0,{"$error":"#VALUE!"},{"$f":"IF(S906<='Collection System Summary_Table'!$I$8,\"Yes\",\"NO\")","v":"Yes"}]
[null,null,null,null,null,null,null,null,null,null,null,null,0,{"$error":"#VALUE!"},{"$error":"#VALUE!"},0,{"$error":"#VALUE!"},{"$error":"#VALUE!"},0,{"$error":"#VALUE!"},{"$f":"IF(S907<='Collection System Summary_Table'!$I$8,\"Yes\",\"NO\")","v":"Yes"}]
[null,null,null,null,null,null,null,null,null,null,null,null,0,{"$error":"#VALUE!"},{"$error":"#VALUE!"},0,{"$error":"#VALUE!"},{"$error":"#VALUE!"},0,{"$error":"#VALUE!"},{"$f":"IF(S908<='Collection System Summary_Table'!$I$8,\"Yes\",\"NO\")","v":"Yes"}]
[null,null,null,null,null,null,null,null,null,null,null,null,0,{"$error":"#VALUE!"},{"$error":"#VALUE!"},0,{"$error":"#VALUE!"},{"$error":"#VALUE!"},0,{"$error":"#VALUE!"},{"$f":"IF(S909<='Collection System Summary_Table'!$I$8,\"Yes\",\"NO\")","v":"Yes"}]
[null,null,null,null,null,null,null,null,null,null,null,null,0,{"$error":"#VALUE!"},{"$error":"#VALUE!"},0,{"$error":"#VALUE!"},{"$error":"#VALUE!"},0,{"$error":"#VALUE!"},{"$f":"IF(S910<='Collection System Summary_Table'!$I$8,\"Yes\",\"NO\")","v":"Yes"}]
[null,null,null,null,null,null,null,null,null,null,null,null,0,{"$error":"#VALUE!"},{"$error":"#VALUE!"},0,{"$error":"#VALUE!"},{"$error":"#VALUE!"},0,{"$error":"#VALUE!"},{"$f":"IF(S911<='Collection System Summary_Table'!$I$8,\"Yes\",\"NO\")","v":"Yes"}]
[null,null,null,null,null,null,null,null,null,null,null,null,0,{"$error":"#VALUE!"},{"$error":"#VALUE!"},0,{"$error":"#VALUE!"},{"$error":"#VALUE!"},0,{"$error":"#VALUE!"},{"$f":"IF(S912<='Collection System Summary_Table'!$I$8,\"Yes\",\"NO\")","v":"Yes"}]
[null,null,null,null,null,null,null,null,null,null,null,null,0,{"$error":"#VALUE!"},{"$error":"#VALUE!"},0,{"$error":"#VALUE!"},{"$error":"#VALUE!"},0,{"$error":"#VALUE!"},{"$f":"IF(S913<='Collection System Summary_Table'!$I$8,\"Yes\",\"NO\")","v":"Yes"}]
[null,null,null,null,null,null,null,null,null,null,null,null,0,{"$error":"#VALUE!"},{"$error":"#VALUE!"},0,{"$error":"#VALUE!"},{"$error":"#VALUE!"},0,{"$error":"#VALUE!"},{"$f":"IF(S914<='Collection System Summary_Table'!$I$8,\"Yes\",\"NO\")","v":"Yes"}]
[null,null,null,null,null,null,null,null,null,null,null,null,0,{"$error":"#VALUE!"},{"$error":"#VALUE!"},0,{"$error":"#VALUE!"},{"$error":"#VALUE!"},0,{"$error":"#VALUE!"},{"$f":"IF(S915<='Collection System Summary_Table'!$I$8,\"Yes\",\"NO\")","v":"Yes"}]
[null,null,null,null,null,null,null,null,null,null,null,null,0,{"$error":"#VALUE!"},{"$error":"#VALUE!"},0,{"$error":"#VALUE!"},{"$error":"#VALUE!"},0,{"$error":"#VALUE!"},{"$f":"IF(S916<='Collection System Summary_Table'!$I$8,\"Yes\",\"NO\")","v":"Yes"}]
[null,null,null,null,null,null,null,null,null,null,null,null,0,{"$error":"#VALUE!"},{"$error":"#VALUE!"},0,{"$error":"#VALUE!"},{"$error":"#VALUE!"},0,{"$error":"#VALUE!"},{"$f":"IF(S917<='Collection System Summary_Table'!$I$8,\"Yes\",\"NO\")","v":"Yes"}]
[null,null,null,null,null,null,null,null,null,null,null,null,0,{"$error":"#VALUE!"},{"$error":"#VALUE!"},0,{"$error":"#VALUE!"},{"$error":"#VALUE!"},0,{"$error":"#VALUE!"},{"$f":"IF(S918<='Collection System Summary_Table'!$I$8,\"Yes\",\"NO\")","v":"Yes"}]
[null,null,null,null,null,null,null,null,null,null,null,null,0,{"$error":"#VALUE!"},{"$error":"#VALUE!"},0,{"$error":"#VALUE!"},{"$error":"#VALUE!"},0,{"$error":"#VALUE!"},{"$f":"IF(S919<='Collection System Summary_Table'!$I$8,\"Yes\",\"NO\")","v":"Yes"}]
[null,null,null,null,null,null,null,null,null,null,null,null,0,{"$error":"#VALUE!"},{"$error":"#VALUE!"},0,{"$error":"#VALUE!"},{"$error":"#VALUE!"},0,{"$error":"#VALUE!"},{"$f":"IF(S920<='Collection System Summary_Table'!$I$8,\"Yes\",\"NO\")","v":"Yes"}]
[null,null,null,null,null,null,null,null,null,null,null,null,0,{"$error":"#VALUE!"},{"$error":"#VALUE!"},0,{"$error":"#VALUE!"},{"$error":"#VALUE!"},0,{"$error":"#VALUE!"},{"$f":"IF(S921<='Collection System Summary_Table'!$I$8,\"Yes\",\"NO\")","v":"Yes"}]
[null,null,null,null,null,null,null,null,null,null,null,null,0,{"$error":"#VALUE!"},{"$error":"#VALUE!"},0,{"$error":"#VALUE!"},{"$error":"#VALUE!"},0,{"$error":"#VALUE!"},{"$f":"IF(S922<='Collection System Summary_Table'!$I$8,\"Yes\",\"NO\")","v":"Yes"}]
[null,null,null,null,null,null,null,null,null,null,null,null,0,{"$error":"#VALUE!"},{"$error":"#VALUE!"},0,{"$error":"#VALUE!"},{"$error":"#VALUE!"},0,{"$error":"#VALUE!"},{"$f":"IF(S923<='Collection System Summary_Table'!$I$8,\"Yes\",\"NO\")","v":"Yes"}]
[null,null,null,null,null,null,null,null,null,null,null,null,0,{"$error":"#VALUE!"},{"$error":"#VALUE!"},0,{"$error":"#VALUE!"},{"$error":"#VALUE!"},0,{"$error":"#VALUE!"},{"$f":"IF(S924<='Collection System Summary_Table'!$I$8,\"Yes\",\"NO\")","v":"Yes"}]
[null,null,null,null,null,null,null,null,null,null,null,null,0,{"$error":"#VALUE!"},{"$error":"#VALUE!"},0,{"$error":"#VALUE!"},{"$error":"#VALUE!"},0,{"$error":"#VALUE!"},{"$f":"IF(S925<='Collection System Summary_Table'!$I$8,\"Yes\",\"NO\")","v":"Yes"}]
[null,null,null,null,null,null,null,null,null,null,null,null,0,{"$error":"#VALUE!"},{"$error":"#VALUE!"},0,{"$error":"#VALUE!"},{"$error":"#VALUE!"},0,{"$error":"#VALUE!"},{"$f":"IF(S926<='Collection System Summary_Table'!$I$8,\"Yes\",\"NO\")","v":"Yes"}]
[null,null,null,null,null,null,null,null,null,null,null,null,0,{"$error":"#VALUE!"},{"$error":"#VALUE!"},0,{"$error":"#VALUE!"},{"$error":"#VALUE!"},0,{"$error":"#VALUE!"},{"$f":"IF(S927<='Collection System Summary_Table'!$I$8,\"Yes\",\"NO\")","v":"Yes"}]
[null,null,null,null,null,null,null,null,null,null,null,null,0,{"$error":"#VALUE!"},{"$error":"#VALUE!"},0,{"$error":"#VALUE!"},{"$error":"#VALUE!"},0,{"$error":"#VALUE!"},{"$f":"IF(S928<='Collection System Summary_Table'!$I$8,\"Yes\",\"NO\")","v":"Yes"}]
[null,null,null,null,null,null,null,null,null,null,null,null,0,{"$error":"#VALUE!"},{"$error":"#VALUE!"},0,{"$error":"#VALUE!"},{"$error":"#VALUE!"},0,{"$error":"#VALUE!"},{"$f":"IF(S929<='Collection System Summary_Table'!$I$8,\"Yes\",\"NO\")","v":"Yes"}]
[null,null,null,null,null,null,null,null,null,null,null,null,0,{"$error":"#VALUE!"},{"$error":"#VALUE!"},0,{"$error":"#VALUE!"},{"$error":"#VALUE!"},0,{"$error":"#VALUE!"},{"$f":"IF(S930<='Collection System Summary_Table'!$I$8,\"Yes\",\"NO\")","v":"Yes"}]
[null,null,null,null,null,null,null,null,null,null,null,null,0,{"$error":"#VALUE!"},{"$error":"#VALUE!"},0,{"$error":"#VALUE!"},{"$error":"#VALUE!"},0,{"$error":"#VALUE!"},{"$f":"IF(S931<='Collection System Summary_Table'!$I$8,\"Yes\",\"NO\")","v":"Yes"}]
[null,null,null,null,null,null,null,null,null,null,null,null,0,{"$error":"#VALUE!"},{"$error":"#VALUE!"},0,{"$error":"#VALUE!"},{"$error":"#VALUE!"},0,{"$error":"#VALUE!"},{"$f":"IF(S932<='Collection System Summary_Table'!$I$8,\"Yes\",\"NO\")","v":"Yes"}]
[null,null,null,null,null,null,null,null,null,null,null,null,0,{"$error":"#VALUE!"},{"$error":"#VALUE!"},0,{"$error":"#VALUE!"},{"$error":"#VALUE!"},0,{"$error":"#VALUE!"},{"$f":"IF(S933<='Collection System Summary_Table'!$I$8,\"Yes\",\"NO\")","v":"Yes"}]
[null,null,null,null,null,null,null,null,null,null,null,null,0,{"$error":"#VALUE!"},{"$error":"#VALUE!"},0,{"$error":"#VALUE!"},{"$error":"#VALUE!"},0,{"$error":"#VALUE!"},{"$f":"IF(S934<='Collection System Summary_Table'!$I$8,\"Yes\",\"NO\")","v":"Yes"}]
[null,null,null,null,null,null,null,null,null,null,null,null,0,{"$error":"#VALUE!"},{"$error":"#VALUE!"},0,{"$error":"#VALUE!"},{"$error":"#VALUE!"},0,{"$error":"#VALUE!"},{"$f":"IF(S935<='Collection System Summary_Table'!$I$8,\"Yes\",\"NO\")","v":"Yes"}]
[null,null,null,null,null,null,null,null,null,null,null,null,0,{"$error":"#VALUE!"},{"$error":"#VALUE!"},0,{"$error":"#VALUE!"},{"$error":"#VALUE!"},0,{"$error":"#VALUE!"},{"$f":"IF(S936<='Collection System Summary_Table'!$I$8,\"Yes\",\"NO\")","v":"Yes"}]
[null,null,null,null,null,null,null,null,null,null,null,null,0,{"$error":"#VALUE!"},{"$error":"#VALUE!"},0,{"$error":"#VALUE!"},{"$error":"#VALUE!"},0,{"$error":"#VALUE!"},{"$f":"IF(S937<='Collection System Summary_Table'!$I$8,\"Yes\",\"NO\")","v":"Yes"}]
[null,null,null,null,null,null,null,null,null,null,null,null,0,{"$error":"#VALUE!"},{"$error":"#VALUE!"},0,{"$error":"#VALUE!"},{"$error":"#VALUE!"},0,{"$error":"#VALUE!"},{"$f":"IF(S938<='Collection System Summary_Table'!$I$8,\"Yes\",\"NO\")","v":"Yes"}]
[null,null,null,null,null,null,null,null,null,null,null,null,0,{"$error":"#VALUE!"},{"$error":"#VALUE!"},0,{"$error":"#VALUE!"},{"$error":"#VALUE!"},0,{"$error":"#VALUE!"},{"$f":"IF(S939<='Collection System Summary_Table'!$I$8,\"Yes\",\"NO\")","v":"Yes"}]
[null,null,null,null,null,null,null,null,null,null,null,null,0,{"$error":"#VALUE!"},{"$error":"#VALUE!"},0,{"$error":"#VALUE!"},{"$error":"#VALUE!"},0,{"$error":"#VALUE!"},{"$f":"IF(S940<='Collection System Summary_Table'!$I$8,\"Yes\",\"NO\")","v":"Yes"}]
[null,null,null,null,null,null,null,null,null,null,null,null,0,{"$error":"#VALUE!"},{"$error":"#VALUE!"},0,{"$error":"#VALUE!"},{"$error":"#VALUE!"},0,{"$error":"#VALUE!"},{"$f":"IF(S941<='Collection System Summary_Table'!$I$8,\"Yes\",\"NO\")","v":"Yes"}]
[null,null,null,null,null,null,null,null,null,null,null,null,0,{"$error":"#VALUE!"},{"$error":"#VALUE!"},0,{"$error":"#VALUE!"},{"$error":"#VALUE!"},0,{"$error":"#VALUE!"},{"$f":"IF(S942<='Collection System Summary_Table'!$I$8,\"Yes\",\"NO\")","v":"Yes"}]
[null,null,null,null,null,null,null,null,null,null,null,null,0,{"$error":"#VALUE!"},{"$error":"#VALUE!"},0,{"$error":"#VALUE!"},{"$error":"#VALUE!"},0,{"$error":"#VALUE!"},{"$f":"IF(S943<='Collection System Summary_Table'!$I$8,\"Yes\",\"NO\")","v":"Yes"}]
[null,null,null,null,null,null,null,null,null,null,null,null,0,{"$error":"#VALUE!"},{"$error":"#VALUE!"},0,{"$error":"#VALUE!"},{"$error":"#VALUE!"},0,{"$error":"#VALUE!"},{"$f":"IF(S944<='Collection System Summary_Table'!$I$8,\"Yes\",\"NO\")","v":"Yes"}]
[null,null,null,null,null,null,null,null,null,null,null,null,0,{"$error":"#VALUE!"},{"$error":"#VALUE!"},0,{"$error":"#VALUE!"},{"$error":"#VALUE!"},0,{"$error":"#VALUE!"},{"$f":"IF(S945<='Collection System Summary_Table'!$I$8,\"Yes\",\"NO\")","v":"Yes"}]
[null,null,null,null,null,null,null,null,null,null,null,null,0,{"$error":"#VALUE!"},{"$error":"#VALUE!"},0,{"$error":"#VALUE!"},{"$error":"#VALUE!"},0,{"$error":"#VALUE!"},{"$f":"IF(S946<='Collection System Summary_Table'!$I$8,\"Yes\",\"NO\")","v":"Yes"}]
[null,null,null,null,null,null,null,null,null,null,null,null,0,{"$error":"#VALUE!"},{"$error":"#VALUE!"},0,{"$error":"#VALUE!"},{"$error":"#VALUE!"},0,{"$error":"#VALUE!"},{"$f":"IF(S947<='Collection System Summary_Table'!$I$8,\"Yes\",\"NO\")","v":"Yes"}]
[null,null,null,null,null,null,null,null,null,null,null,null,0,{"$error":"#VALUE!"},{"$error":"#VALUE!"},0,{"$error":"#VALUE!"},{"$error":"#VALUE!"},0,{"$error":"#VALUE!"},{"$f":"IF(S948<='Collection System Summary_Table'!$I$8,\"Yes\",\"NO\")","v":"Yes"}]
[null,null,null,null,null,null,null,null,null,null,null,null,0,{"$error":"#VALUE!"},{"$error":"#VALUE!"},0,{"$error":"#VALUE!"},{"$error":"#VALUE!"},0,{"$error":"#VALUE!"},{"$f":"IF(S949<='Collection System Summary_Table'!$I$8,\"Yes\",\"NO\")","v":"Yes"}]
[null,null,null,null,null,null,null,null,null,null,null,null,0,{"$error":"#VALUE!"},{"$error":"#VALUE!"},0,{"$error":"#VALUE!"},{"$error":"#VALUE!"},0,{"$error":"#VALUE!"},{"$f":"IF(S950<='Collection System Summary_Table'!$I$8,\"Yes\",\"NO\")","v":"Yes"}]
[null,null,null,null,null,null,null,null,null,null,null,null,0,{"$error":"#VALUE!"},{"$error":"#VALUE!"},0,{"$error":"#VALUE!"},{"$error":"#VALUE!"},0,{"$error":"#VALUE!"},{"$f":"IF(S951<='Collection System Summary_Table'!$I$8,\"Yes\",\"NO\")","v":"Yes"}]
[null,null,null,null,null,null,null,null,null,null,null,null,0,{"$error":"#VALUE!"},{"$error":"#VALUE!"},0,{"$error":"#VALUE!"},{"$error":"#VALUE!"},0,{"$error":"#VALUE!"},{"$f":"IF(S952<='Collection System Summary_Table'!$I$8,\"Yes\",\"NO\")","v":"Yes"}]
[null,null,null,null,null,null,null,null,null,null,null,null,0,{"$error":"#VALUE!"},{"$error":"#VALUE!"},0,{"$error":"#VALUE!"},{"$error":"#VALUE!"},0,{"$error":"#VALUE!"},{"$f":"IF(S953<='Collection System Summary_Table'!$I$8,\"Yes\",\"NO\")","v":"Yes"}]
[null,null,null,null,null,null,null,null,null,null,null,null,0,{"$error":"#VALUE!"},{"$error":"#VALUE!"},0,{"$error":"#VALUE!"},{"$error":"#VALUE!"},0,{"$error":"#VALUE!"},{"$f":"IF(S954<='Collection System Summary_Table'!$I$8,\"Yes\",\"NO\")","v":"Yes"}]
[null,null,null,null,null,null,null,null,null,null,null,null,0,{"$error":"#VALUE!"},{"$error":"#VALUE!"},0,{"$error":"#VALUE!"},{"$error":"#VALUE!"},0,{"$error":"#VALUE!"},{"$f":"IF(S955<='Collection System Summary_Table'!$I$8,\"Yes\",\"NO\")","v":"Yes"}]
[null,null,null,null,null,null,null,null,null,null,null,null,0,{"$error":"#VALUE!"},{"$error":"#VALUE!"},0,{"$error":"#VALUE!"},{"$error":"#VALUE!"},0,{"$error":"#VALUE!"},{"$f":"IF(S956<='Collection System Summary_Table'!$I$8,\"Yes\",\"NO\")","v":"Yes"}]
[null,null,null,null,null,null,null,null,null,null,null,null,0,{"$error":"#VALUE!"},{"$error":"#VALUE!"},0,{"$error":"#VALUE!"},{"$error":"#VALUE!"},0,{"$error":"#VALUE!"},{"$f":"IF(S957<='Collection System Summary_Table'!$I$8,\"Yes\",\"NO\")","v":"Yes"}]
[null,null,null,null,null,null,null,null,null,null,null,null,0,{"$error":"#VALUE!"},{"$error":"#VALUE!"},0,{"$error":"#VALUE!"},{"$error":"#VALUE!"},0,{"$error":"#VALUE!"},{"$f":"IF(S958<='Collection System Summary_Table'!$I$8,\"Yes\",\"NO\")","v":"Yes"}]
[null,null,null,null,null,null,null,null,null,null,null,null,0,{"$error":"#VALUE!"},{"$error":"#VALUE!"},0,{"$error":"#VALUE!"},{"$error":"#VALUE!"},0,{"$error":"#VALUE!"},{"$f":"IF(S959<='Collection System Summary_Table'!$I$8,\"Yes\",\"NO\")","v":"Yes"}]
[null,null,null,null,null,null,null,null,null,null,null,null,0,{"$error":"#VALUE!"},{"$error":"#VALUE!"},0,{"$error":"#VALUE!"},{"$error":"#VALUE!"},0,{"$error":"#VALUE!"},{"$f":"IF(S960<='Collection System Summary_Table'!$I$8,\"Yes\",\"NO\")","v":"Yes"}]
[null,null,null,null,null,null,null,null,null,null,null,null,0,{"$error":"#VALUE!"},{"$error":"#VALUE!"},0,{"$error":"#VALUE!"},{"$error":"#VALUE!"},0,{"$error":"#VALUE!"},{"$f":"IF(S961<='Collection System Summary_Table'!$I$8,\"Yes\",\"NO\")","v":"Yes"}]
[null,null,null,null,null,null,null,null,null,null,null,null,0,{"$error":"#VALUE!"},{"$error":"#VALUE!"},0,{"$error":"#VALUE!"},{"$error":"#VALUE!"},0,{"$error":"#VALUE!"},{"$f":"IF(S962<='Collection System Summary_Table'!$I$8,\"Yes\",\"NO\")","v":"Yes"}]
[null,null,null,null,null,null,null,null,null,null,null,null,0,{"$f":"IF(P963=0,I963+N962,0)","v":{"$error":"#VALUE!"}},{"$error":"#VALUE!"},0,{"$error":"#VALUE!"},{"$error":"#VALUE!"},0,{"$error":"#VALUE!"},{"$f":"IF(S963<='Collection System Summary_Table'!$I$8,\"Yes\",\"NO\")","v":"Yes"}]
[null,null,null,null,null,null,null,null,null,null,null,null,0,{"$error":"#VALUE!"},{"$f":"IF(AND(Q964=0,P964=0),K964+O963,0)","v":{"$error":"#VALUE!"}},0,{"$f":"IF(AND(P964=0,N964<($B$4+$P$1)),J964,0)","v":{"$error":"#VALUE!"}},{"$f":"IF(AND(P964=0,Q964=0,O964<($B$5+$Q$1)),K964,0)","v":{"$error":"#VALUE!"}},{"$f":"S963+L964","v":0},{"$f":"IF(OR(P964>1,Q964>1,R964>1),\"YES\",\"NO\")","v":{"$error":"#VALUE!"}},{"$f":"IF(S964<='Collection System Summary_Table'!$I$8,\"Yes\",\"NO\")","v":"Yes"}]
[null,null,null,null,null,null,null,null,null,null,null,null,{"$f":"M964+I965","v":0},{"$error":"#VALUE!"},{"$error":"#VALUE!"},{"$f":"IF(M965<=$B$3,I965,0)","v":0},{"$error":"#VALUE!"},{"$error":"#VALUE!"},0,{"$error":"#VALUE!"},{"$f":"IF(S965<='Collection System Summary_Table'!$I$8,\"Yes\",\"NO\")","v":"Yes"}]
[null,null,null,null,null,null,null,null,null,null,null,null,0,{"$error":"#VALUE!"},{"$error":"#VALUE!"},0,{"$error":"#VALUE!"},{"$error":"#VALUE!"},0,{"$error":"#VALUE!"},{"$f":"IF(S966<='Collection System Summary_Table'!$I$8,\"Yes\",\"NO\")","v":"Yes"}]
[null,null,null,null,null,null,null,null,null,null,null,null,0,{"$error":"#VALUE!"},{"$error":"#VALUE!"},0,{"$error":"#VALUE!"},{"$error":"#VALUE!"},0,{"$error":"#VALUE!"},{"$f":"IF(S967<='Collection System Summary_Table'!$I$8,\"Yes\",\"NO\")","v":"Yes"}]
[null,null,null,null,null,null,null,null,null,null,null,null,0,{"$error":"#VALUE!"},{"$error":"#VALUE!"},0,{"$error":"#VALUE!"},{"$error":"#VALUE!"},0,{"$error":"#VALUE!"},{"$f":"IF(S968<='Collection System Summary_Table'!$I$8,\"Yes\",\"NO\")","v":"Yes"}]
[null,null,null,null,null,null,null,null,null,null,null,null,0,{"$error":"#VALUE!"},{"$error":"#VALUE!"},0,{"$error":"#VALUE!"},{"$error":"#VALUE!"},0,{"$error":"#VALUE!"},{"$f":"IF(S969<='Collection System Summary_Table'!$I$8,\"Yes\",\"NO\")","v":"Yes"}]
[null,null,null,null,null,null,null,null,null,null,null,null,0,{"$error":"#VALUE!"},{"$error":"#VALUE!"},0,{"$error":"#VALUE!"},{"$error":"#VALUE!"},0,{"$error":"#VALUE!"},{"$f":"IF(S970<='Collection System Summary_Table'!$I$8,\"Yes\",\"NO\")","v":"Yes"}]
[null,null,null,null,null,null,null,null,null,null,null,null,0,{"$error":"#VALUE!"},{"$error":"#VALUE!"},0,{"$error":"#VALUE!"},{"$error":"#VALUE!"},0,{"$error":"#VALUE!"},{"$f":"IF(S971<='Collection System Summary_Table'!$I$8,\"Yes\",\"NO\")","v":"Yes"}]
[null,null,null,null,null,null,null,null,null,null,null,null,0,{"$error":"#VALUE!"},{"$error":"#VALUE!"},0,{"$error":"#VALUE!"},{"$error":"#VALUE!"},0,{"$error":"#VALUE!"},{"$f":"IF(S972<='Collection System Summary_Table'!$I$8,\"Yes\",\"NO\")","v":"Yes"}]
[null,null,null,null,null,null,null,null,null,null,null,null,0,{"$error":"#VALUE!"},{"$error":"#VALUE!"},0,{"$error":"#VALUE!"},{"$error":"#VALUE!"},0,{"$error":"#VALUE!"},{"$f":"IF(S973<='Collection System Summary_Table'!$I$8,\"Yes\",\"NO\")","v":"Yes"}]
[null,null,null,null,null,null,null,null,null,null,null,null,0,{"$error":"#VALUE!"},{"$error":"#VALUE!"},0,{"$error":"#VALUE!"},{"$error":"#VALUE!"},0,{"$error":"#VALUE!"},{"$f":"IF(S974<='Collection System Summary_Table'!$I$8,\"Yes\",\"NO\")","v":"Yes"}]
[null,null,null,null,null,null,null,null,null,null,null,null,0,{"$error":"#VALUE!"},{"$error":"#VALUE!"},0,{"$error":"#VALUE!"},{"$error":"#VALUE!"},0,{"$error":"#VALUE!"},{"$f":"IF(S975<='Collection System Summary_Table'!$I$8,\"Yes\",\"NO\")","v":"Yes"}]
[null,null,null,null,null,null,null,null,null,null,null,null,0,{"$error":"#VALUE!"},{"$error":"#VALUE!"},0,{"$error":"#VALUE!"},{"$error":"#VALUE!"},0,{"$error":"#VALUE!"},{"$f":"IF(S976<='Collection System Summary_Table'!$I$8,\"Yes\",\"NO\")","v":"Yes"}]
[null,null,null,null,null,null,null,null,null,null,null,null,0,{"$error":"#VALUE!"},{"$error":"#VALUE!"},0,{"$error":"#VALUE!"},{"$error":"#VALUE!"},0,{"$error":"#VALUE!"},{"$f":"IF(S977<='Collection System Summary_Table'!$I$8,\"Yes\",\"NO\")","v":"Yes"}]
[null,null,null,null,null,null,null,null,null,null,null,null,0,{"$error":"#VALUE!"},{"$error":"#VALUE!"},0,{"$error":"#VALUE!"},{"$error":"#VALUE!"},0,{"$error":"#VALUE!"},{"$f":"IF(S978<='Collection System Summary_Table'!$I$8,\"Yes\",\"NO\")","v":"Yes"}]
[null,null,null,null,null,null,null,null,null,null,null,null,0,{"$error":"#VALUE!"},{"$error":"#VALUE!"},0,{"$error":"#VALUE!"},{"$error":"#VALUE!"},0,{"$error":"#VALUE!"},{"$f":"IF(S979<='Collection System Summary_Table'!$I$8,\"Yes\",\"NO\")","v":"Yes"}]
[null,null,null,null,null,null,null,null,null,null,null,null,0,{"$error":"#VALUE!"},{"$error":"#VALUE!"},0,{"$error":"#VALUE!"},{"$error":"#VALUE!"},0,{"$error":"#VALUE!"},{"$f":"IF(S980<='Collection System Summary_Table'!$I$8,\"Yes\",\"NO\")","v":"Yes"}]
[null,null,null,null,null,null,null,null,null,null,null,null,0,{"$error":"#VALUE!"},{"$error":"#VALUE!"},0,{"$error":"#VALUE!"},{"$error":"#VALUE!"},0,{"$error":"#VALUE!"},{"$f":"IF(S981<='Collection System Summary_Table'!$I$8,\"Yes\",\"NO\")","v":"Yes"}]
[null,null,null,null,null,null,null,null,null,null,null,null,0,{"$error":"#VALUE!"},{"$error":"#VALUE!"},0,{"$error":"#VALUE!"},{"$error":"#VALUE!"},0,{"$error":"#VALUE!"},{"$f":"IF(S982<='Collection System Summary_Table'!$I$8,\"Yes\",\"NO\")","v":"Yes"}]
[null,null,null,null,null,null,null,null,null,null,null,null,0,{"$error":"#VALUE!"},{"$error":"#VALUE!"},0,{"$error":"#VALUE!"},{"$error":"#VALUE!"},0,{"$error":"#VALUE!"},{"$f":"IF(S983<='Collection System Summary_Table'!$I$8,\"Yes\",\"NO\")","v":"Yes"}]
[null,null,null,null,null,null,null,null,null,null,null,null,0,{"$error":"#VALUE!"},{"$error":"#VALUE!"},0,{"$error":"#VALUE!"},{"$error":"#VALUE!"},0,{"$error":"#VALUE!"},{"$f":"IF(S984<='Collection System Summary_Table'!$I$8,\"Yes\",\"NO\")","v":"Yes"}]
[null,null,null,null,null,null,null,null,null,null,null,null,0,{"$error":"#VALUE!"},{"$error":"#VALUE!"},0,{"$error":"#VALUE!"},{"$error":"#VALUE!"},0,{"$error":"#VALUE!"},{"$f":"IF(S985<='Collection System Summary_Table'!$I$8,\"Yes\",\"NO\")","v":"Yes"}]
[null,null,null,null,null,null,null,null,null,null,null,null,0,{"$error":"#VALUE!"},{"$error":"#VALUE!"},0,{"$error":"#VALUE!"},{"$error":"#VALUE!"},0,{"$error":"#VALUE!"},{"$f":"IF(S986<='Collection System Summary_Table'!$I$8,\"Yes\",\"NO\")","v":"Yes"}]
[null,null,null,null,null,null,null,null,null,null,null,null,0,{"$error":"#VALUE!"},{"$error":"#VALUE!"},0,{"$error":"#VALUE!"},{"$error":"#VALUE!"},0,{"$error":"#VALUE!"},{"$f":"IF(S987<='Collection System Summary_Table'!$I$8,\"Yes\",\"NO\")","v":"Yes"}]
[null,null,null,null,null,null,null,null,null,null,null,null,0,{"$error":"#VALUE!"},{"$error":"#VALUE!"},0,{"$error":"#VALUE!"},{"$error":"#VALUE!"},0,{"$error":"#VALUE!"},{"$f":"IF(S988<='Collection System Summary_Table'!$I$8,\"Yes\",\"NO\")","v":"Yes"}]
[null,null,null,null,null,null,null,null,null,null,null,null,0,{"$error":"#VALUE!"},{"$error":"#VALUE!"},0,{"$error":"#VALUE!"},{"$error":"#VALUE!"},0,{"$error":"#VALUE!"},{"$f":"IF(S989<='Collection System Summary_Table'!$I$8,\"Yes\",\"NO\")","v":"Yes"}]
[null,null,null,null,null,null,null,null,null,null,null,null,0,{"$error":"#VALUE!"},{"$error":"#VALUE!"},0,{"$error":"#VALUE!"},{"$error":"#VALUE!"},0,{"$error":"#VALUE!"},{"$f":"IF(S990<='Collection System Summary_Table'!$I$8,\"Yes\",\"NO\")","v":"Yes"}]
[null,null,null,null,null,null,null,null,null,null,null,null,0,{"$error":"#VALUE!"},{"$error":"#VALUE!"},0,{"$error":"#VALUE!"},{"$error":"#VALUE!"},0,{"$error":"#VALUE!"},{"$f":"IF(S991<='Collection System Summary_Table'!$I$8,\"Yes\",\"NO\")","v":"Yes"}]
[null,null,null,null,null,null,null,null,null,null,null,null,0,{"$error":"#VALUE!"},{"$error":"#VALUE!"},0,{"$error":"#VALUE!"},{"$error":"#VALUE!"},0,{"$error":"#VALUE!"},{"$f":"IF(S992<='Collection System Summary_Table'!$I$8,\"Yes\",\"NO\")","v":"Yes"}]
[null,null,null,null,null,null,null,null,null,null,null,null,0,{"$error":"#VALUE!"},{"$error":"#VALUE!"},0,{"$error":"#VALUE!"},{"$error":"#VALUE!"},0,{"$error":"#VALUE!"},{"$f":"IF(S993<='Collection System Summary_Table'!$I$8,\"Yes\",\"NO\")","v":"Yes"}]
[null,null,null,null,null,null,null,null,null,null,null,null,0,{"$error":"#VALUE!"},{"$error":"#VALUE!"},0,{"$error":"#VALUE!"},{"$error":"#VALUE!"},0,{"$error":"#VALUE!"},{"$f":"IF(S994<='Collection System Summary_Table'!$I$8,\"Yes\",\"NO\")","v":"Yes"}]
[null,null,null,null,null,null,null,null,null,null,null,null,0,{"$error":"#VALUE!"},{"$error":"#VALUE!"},0,{"$error":"#VALUE!"},{"$error":"#VALUE!"},0,{"$error":"#VALUE!"},{"$f":"IF(S995<='Collection System Summary_Table'!$I$8,\"Yes\",\"NO\")","v":"Yes"}]
[null,null,null,null,null,null,null,null,null,null,null,null,0,{"$error":"#VALUE!"},{"$error":"#VALUE!"},0,{"$error":"#VALUE!"},{"$error":"#VALUE!"},0,{"$error":"#VALUE!"},{"$f":"IF(S996<='Collection System Summary_Table'!$I$8,\"Yes\",\"NO\")","v":"Yes"}]
[null,null,null,null,null,null,null,null,null,null,null,null,0,{"$error":"#VALUE!"},{"$error":"#VALUE!"},0,{"$error":"#VALUE!"},{"$error":"#VALUE!"},0,{"$error":"#VALUE!"},{"$f":"IF(S997<='Collection System Summary_Table'!$I$8,\"Yes\",\"NO\")","v":"Yes"}]
[null,null,null,null,null,null,null,null,null,null,null,null,0,{"$error":"#VALUE!"},{"$error":"#VALUE!"},0,{"$error":"#VALUE!"},{"$error":"#VALUE!"},0,{"$error":"#VALUE!"},{"$f":"IF(S998<='Collection System Summary_Table'!$I$8,\"Yes\",\"NO\")","v":"Yes"}]
[null,null,null,null,null,null,null,null,null,null,null,null,0,{"$error":"#VALUE!"},{"$error":"#VALUE!"},0,{"$error":"#VALUE!"},{"$error":"#VALUE!"},0,{"$error":"#VALUE!"},{"$f":"IF(S999<='Collection System Summary_Table'!$I$8,\"Yes\",\"NO\")","v":"Yes"}]
[null,null,null,null,null,null,null,null,null,null,null,null,0,{"$error":"#VALUE!"},{"$error":"#VALUE!"},0,{"$error":"#VALUE!"},{"$error":"#VALUE!"},0,{"$error":"#VALUE!"},{"$f":"IF(S1000<='Collection System Summary_Table'!$I$8,\"Yes\",\"NO\")","v":"Yes"}]
[null,null,null,null,null,null,null,null,null,null,null,null,0,{"$error":"#VALUE!"},{"$error":"#VALUE!"},0,{"$error":"#VALUE!"},{"$error":"#VALUE!"},0,{"$error":"#VALUE!"},{"$f":"IF(S1001<='Collection System Summary_Table'!$I$8,\"Yes\",\"NO\")","v":"Yes"}]
[null,null,null,null,null,null,null,null,null,null,null,null,0,{"$error":"#VALUE!"},{"$error":"#VALUE!"},0,{"$error":"#VALUE!"},{"$error":"#VALUE!"},0,{"$error":"#VALUE!"},{"$f":"IF(S1002<='Collection System Summary_Table'!$I$8,\"Yes\",\"NO\")","v":"Yes"}]
[null,null,null,null,null,null,null,null,null,null,null,null,0,{"$error":"#VALUE!"},{"$error":"#VALUE!"},0,{"$error":"#VALUE!"},{"$error":"#VALUE!"},0,{"$error":"#VALUE!"},{"$f":"IF(S1003<='Collection System Summary_Table'!$I$8,\"Yes\",\"NO\")","v":"Yes"}]
[null,null,null,null,null,null,null,null,null,null,null,null,0,{"$error":"#VALUE!"},{"$error":"#VALUE!"},0,{"$error":"#VALUE!"},{"$error":"#VALUE!"},0,{"$error":"#VALUE!"},{"$f":"IF(S1004<='Collection System Summary_Table'!$I$8,\"Yes\",\"NO\")","v":"Yes"}]
[null,null,null,null,null,null,null,null,null,null,null,null,0,{"$error":"#VALUE!"},{"$error":"#VALUE!"},0,{"$error":"#VALUE!"},{"$error":"#VALUE!"},0,{"$error":"#VALUE!"},{"$f":"IF(S1005<='Collection System Summary_Table'!$I$8,\"Yes\",\"NO\")","v":"Yes"}]
[null,null,null,null,null,null,null,null,null,null,null,null,0,{"$error":"#VALUE!"},{"$error":"#VALUE!"},0,{"$error":"#VALUE!"},{"$error":"#VALUE!"},0,{"$error":"#VALUE!"},{"$f":"IF(S1006<='Collection System Summary_Table'!$I$8,\"Yes\",\"NO\")","v":"Yes"}]
[null,null,null,null,null,null,null,null,null,null,null,null,0,{"$error":"#VALUE!"},{"$error":"#VALUE!"},0,{"$error":"#VALUE!"},{"$error":"#VALUE!"},0,{"$error":"#VALUE!"},{"$f":"IF(S1007<='Collection System Summary_Table'!$I$8,\"Yes\",\"NO\")","v":"Yes"}]
[null,null,null,null,null,null,null,null,null,null,null,null,0,{"$error":"#VALUE!"},{"$error":"#VALUE!"},0,{"$error":"#VALUE!"},{"$error":"#VALUE!"},0,{"$error":"#VALUE!"},{"$f":"IF(S1008<='Collection System Summary_Table'!$I$8,\"Yes\",\"NO\")","v":"Yes"}]
[null,null,null,null,null,null,null,null,null,null,null,null,0,{"$error":"#VALUE!"},{"$error":"#VALUE!"},0,{"$error":"#VALUE!"},{"$error":"#VALUE!"},0,{"$error":"#VALUE!"},{"$f":"IF(S1009<='Collection System Summary_Table'!$I$8,\"Yes\",\"NO\")","v":"Yes"}]
[null,null,null,null,null,null,null,null,null,null,null,null,0,{"$error":"#VALUE!"},{"$error":"#VALUE!"},0,{"$error":"#VALUE!"},{"$error":"#VALUE!"},0,{"$error":"#VALUE!"},{"$f":"IF(S1010<='Collection System Summary_Table'!$I$8,\"Yes\",\"NO\")","v":"Yes"}]
[null,null,null,null,null,null,null,null,null,null,null,null,0,{"$error":"#VALUE!"},{"$error":"#VALUE!"},0,{"$error":"#VALUE!"},{"$error":"#VALUE!"},0,{"$error":"#VALUE!"},{"$f":"IF(S1011<='Collection System Summary_Table'!$I$8,\"Yes\",\"NO\")","v":"Yes"}]
[null,null,null,null,null,null,null,null,null,null,null,null,0,{"$error":"#VALUE!"},{"$error":"#VALUE!"},0,{"$error":"#VALUE!"},{"$error":"#VALUE!"},0,{"$error":"#VALUE!"},{"$f":"IF(S1012<='Collection System Summary_Table'!$I$8,\"Yes\",\"NO\")","v":"Yes"}]
[null,null,null,null,null,null,null,null,null,null,null,null,0,{"$error":"#VALUE!"},{"$error":"#VALUE!"},0,{"$error":"#VALUE!"},{"$error":"#VALUE!"},0,{"$error":"#VALUE!"},{"$f":"IF(S1013<='Collection System Summary_Table'!$I$8,\"Yes\",\"NO\")","v":"Yes"}]
[null,null,null,null,null,null,null,null,null,null,null,null,0,{"$error":"#VALUE!"},{"$error":"#VALUE!"},0,{"$error":"#VALUE!"},{"$error":"#VALUE!"},0,{"$error":"#VALUE!"},{"$f":"IF(S1014<='Collection System Summary_Table'!$I$8,\"Yes\",\"NO\")","v":"Yes"}]
[null,null,null,null,null,null,null,null,null,null,null,null,0,{"$error":"#VALUE!"},{"$error":"#VALUE!"},0,{"$error":"#VALUE!"},{"$error":"#VALUE!"},0,{"$error":"#VALUE!"},{"$f":"IF(S1015<='Collection System Summary_Table'!$I$8,\"Yes\",\"NO\")","v":"Yes"}]
[null,null,null,null,null,null,null,null,null,null,null,null,0,{"$error":"#VALUE!"},{"$error":"#VALUE!"},0,{"$error":"#VALUE!"},{"$error":"#VALUE!"},0,{"$error":"#VALUE!"},{"$f":"IF(S1016<='Collection System Summary_Table'!$I$8,\"Yes\",\"NO\")","v":"Yes"}]
[null,null,null,null,null,null,null,null,null,null,null,null,0,{"$error":"#VALUE!"},{"$error":"#VALUE!"},0,{"$error":"#VALUE!"},{"$error":"#VALUE!"},0,{"$error":"#VALUE!"},{"$f":"IF(S1017<='Collection System Summary_Table'!$I$8,\"Yes\",\"NO\")","v":"Yes"}]
[null,null,null,null,null,null,null,null,null,null,null,null,0,{"$error":"#VALUE!"},{"$error":"#VALUE!"},0,{"$error":"#VALUE!"},{"$error":"#VALUE!"},0,{"$error":"#VALUE!"},{"$f":"IF(S1018<='Collection System Summary_Table'!$I$8,\"Yes\",\"NO\")","v":"Yes"}]
[null,null,null,null,null,null,null,null,null,null,null,null,0,{"$error":"#VALUE!"},{"$error":"#VALUE!"},0,{"$error":"#VALUE!"},{"$error":"#VALUE!"},0,{"$error":"#VALUE!"},{"$f":"IF(S1019<='Collection System Summary_Table'!$I$8,\"Yes\",\"NO\")","v":"Yes"}]
[null,null,null,null,null,null,null,null,null,null,null,null,0,{"$error":"#VALUE!"},{"$error":"#VALUE!"},0,{"$error":"#VALUE!"},{"$error":"#VALUE!"},0,{"$error":"#VALUE!"},{"$f":"IF(S1020<='Collection System Summary_Table'!$I$8,\"Yes\",\"NO\")","v":"Yes"}]
[null,null,null,null,null,null,null,null,null,null,null,null,0,{"$error":"#VALUE!"},{"$error":"#VALUE!"},0,{"$error":"#VALUE!"},{"$error":"#VALUE!"},0,{"$error":"#VALUE!"},{"$f":"IF(S1021<='Collection System Summary_Table'!$I$8,\"Yes\",\"NO\")","v":"Yes"}]
[null,null,null,null,null,null,null,null,null,null,null,null,0,{"$error":"#VALUE!"},{"$error":"#VALUE!"},0,{"$error":"#VALUE!"},{"$error":"#VALUE!"},0,{"$error":"#VALUE!"},{"$f":"IF(S1022<='Collection System Summary_Table'!$I$8,\"Yes\",\"NO\")","v":"Yes"}]
[null,null,null,null,null,null,null,null,null,null,null,null,0,{"$error":"#VALUE!"},{"$error":"#VALUE!"},0,{"$error":"#VALUE!"},{"$error":"#VALUE!"},0,{"$error":"#VALUE!"},{"$f":"IF(S1023<='Collection System Summary_Table'!$I$8,\"Yes\",\"NO\")","v":"Yes"}]
[null,null,null,null,null,null,null,null,null,null,null,null,0,{"$error":"#VALUE!"},{"$error":"#VALUE!"},0,{"$error":"#VALUE!"},{"$error":"#VALUE!"},0,{"$error":"#VALUE!"},{"$f":"IF(S1024<='Collection System Summary_Table'!$I$8,\"Yes\",\"NO\")","v":"Yes"}]
[null,null,null,null,null,null,null,null,null,null,null,null,0,{"$error":"#VALUE!"},{"$error":"#VALUE!"},0,{"$error":"#VALUE!"},{"$error":"#VALUE!"},0,{"$error":"#VALUE!"},{"$f":"IF(S1025<='Collection System Summary_Table'!$I$8,\"Yes\",\"NO\")","v":"Yes"}]
[null,null,null,null,null,null,null,null,null,null,null,null,0,{"$error":"#VALUE!"},{"$error":"#VALUE!"},0,{"$error":"#VALUE!"},{"$error":"#VALUE!"},0,{"$error":"#VALUE!"},{"$f":"IF(S1026<='Collection System Summary_Table'!$I$8,\"Yes\",\"NO\")","v":"Yes"}]
[null,null,null,null,null,null,null,null,null,null,null,null,0,{"$f":"IF(P1027=0,I1027+N1026,0)","v":{"$error":"#VALUE!"}},{"$error":"#VALUE!"},0,{"$error":"#VALUE!"},{"$error":"#VALUE!"},0,{"$error":"#VALUE!"},{"$f":"IF(S1027<='Collection System Summary_Table'!$I$8,\"Yes\",\"NO\")","v":"Yes"}]
[null,null,null,null,null,null,null,null,null,null,null,null,0,{"$error":"#VALUE!"},{"$f":"IF(AND(Q1028=0,P1028=0),K1028+O1027,0)","v":{"$error":"#VALUE!"}},0,{"$f":"IF(AND(P1028=0,N1028<($B$4+$P$1)),J1028,0)","v":{"$error":"#VALUE!"}},{"$f":"IF(AND(P1028=0,Q1028=0,O1028<($B$5+$Q$1)),K1028,0)","v":{"$error":"#VALUE!"}},{"$f":"S1027+L1028","v":0},{"$f":"IF(OR(P1028>1,Q1028>1,R1028>1),\"YES\",\"NO\")","v":{"$error":"#VALUE!"}},{"$f":"IF(S1028<='Collection System Summary_Table'!$I$8,\"Yes\",\"NO\")","v":"Yes"}]
[null,null,null,null,null,null,null,null,null,null,null,null,{"$f":"M1028+I1029","v":0},{"$error":"#VALUE!"},{"$error":"#VALUE!"},{"$f":"IF(M1029<=$B$3,I1029,0)","v":0},{"$error":"#VALUE!"},{"$error":"#VALUE!"},0,{"$error":"#VALUE!"},{"$f":"IF(S1029<='Collection System Summary_Table'!$I$8,\"Yes\",\"NO\")","v":"Yes"}]
[null,null,null,null,null,null,null,null,null,null,null,null,0,{"$error":"#VALUE!"},{"$error":"#VALUE!"},0,{"$error":"#VALUE!"},{"$error":"#VALUE!"},0,{"$error":"#VALUE!"},{"$f":"IF(S1030<='Collection System Summary_Table'!$I$8,\"Yes\",\"NO\")","v":"Yes"}]
[null,null,null,null,null,null,null,null,null,null,null,null,0,{"$error":"#VALUE!"},{"$error":"#VALUE!"},0,{"$error":"#VALUE!"},{"$error":"#VALUE!"},0,{"$error":"#VALUE!"},{"$f":"IF(S1031<='Collection System Summary_Table'!$I$8,\"Yes\",\"NO\")","v":"Yes"}]
[null,null,null,null,null,null,null,null,null,null,null,null,0,{"$error":"#VALUE!"},{"$error":"#VALUE!"},0,{"$error":"#VALUE!"},{"$error":"#VALUE!"},0,{"$error":"#VALUE!"},{"$f":"IF(S1032<='Collection System Summary_Table'!$I$8,\"Yes\",\"NO\")","v":"Yes"}]
[null,null,null,null,null,null,null,null,null,null,null,null,0,{"$error":"#VALUE!"},{"$error":"#VALUE!"},0,{"$error":"#VALUE!"},{"$error":"#VALUE!"},0,{"$error":"#VALUE!"},{"$f":"IF(S1033<='Collection System Summary_Table'!$I$8,\"Yes\",\"NO\")","v":"Yes"}]
[null,null,null,null,null,null,null,null,null,null,null,null,0,{"$error":"#VALUE!"},{"$error":"#VALUE!"},0,{"$error":"#VALUE!"},{"$error":"#VALUE!"},0,{"$error":"#VALUE!"},{"$f":"IF(S1034<='Collection System Summary_Table'!$I$8,\"Yes\",\"NO\")","v":"Yes"}]
[null,null,null,null,null,null,null,null,null,null,null,null,0,{"$error":"#VALUE!"},{"$error":"#VALUE!"},0,{"$error":"#VALUE!"},{"$error":"#VALUE!"},0,{"$error":"#VALUE!"},{"$f":"IF(S1035<='Collection System Summary_Table'!$I$8,\"Yes\",\"NO\")","v":"Yes"}]
[null,null,null,null,null,null,null,null,null,null,null,null,0,{"$error":"#VALUE!"},{"$error":"#VALUE!"},0,{"$error":"#VALUE!"},{"$error":"#VALUE!"},0,{"$error":"#VALUE!"},{"$f":"IF(S1036<='Collection System Summary_Table'!$I$8,\"Yes\",\"NO\")","v":"Yes"}]
[null,null,null,null,null,null,null,null,null,null,null,null,0,{"$error":"#VALUE!"},{"$error":"#VALUE!"},0,{"$error":"#VALUE!"},{"$error":"#VALUE!"},0,{"$error":"#VALUE!"},{"$f":"IF(S1037<='Collection System Summary_Table'!$I$8,\"Yes\",\"NO\")","v":"Yes"}]
[null,null,null,null,null,null,null,null,null,null,null,null,0,{"$error":"#VALUE!"},{"$error":"#VALUE!"},0,{"$error":"#VALUE!"},{"$error":"#VALUE!"},0,{"$error":"#VALUE!"},{"$f":"IF(S1038<='Collection System Summary_Table'!$I$8,\"Yes\",\"NO\")","v":"Yes"}]
[null,null,null,null,null,null,null,null,null,null,null,null,0,{"$error":"#VALUE!"},{"$error":"#VALUE!"},0,{"$error":"#VALUE!"},{"$error":"#VALUE!"},0,{"$error":"#VALUE!"},{"$f":"IF(S1039<='Collection System Summary_Table'!$I$8,\"Yes\",\"NO\")","v":"Yes"}]
[null,null,null,null,null,null,null,null,null,null,null,null,0,{"$error":"#VALUE!"},{"$error":"#VALUE!"},0,{"$error":"#VALUE!"},{"$error":"#VALUE!"},0,{"$error":"#VALUE!"},{"$f":"IF(S1040<='Collection System Summary_Table'!$I$8,\"Yes\",\"NO\")","v":"Yes"}]
[null,null,null,null,null,null,null,null,null,null,null,null,0,{"$error":"#VALUE!"},{"$error":"#VALUE!"},0,{"$error":"#VALUE!"},{"$error":"#VALUE!"},0,{"$error":"#VALUE!"},{"$f":"IF(S1041<='Collection System Summary_Table'!$I$8,\"Yes\",\"NO\")","v":"Yes"}]
[null,null,null,null,null,null,null,null,null,null,null,null,0,{"$error":"#VALUE!"},{"$error":"#VALUE!"},0,{"$error":"#VALUE!"},{"$error":"#VALUE!"},0,{"$error":"#VALUE!"},{"$f":"IF(S1042<='Collection System Summary_Table'!$I$8,\"Yes\",\"NO\")","v":"Yes"}]
[null,null,null,null,null,null,null,null,null,null,null,null,0,{"$error":"#VALUE!"},{"$error":"#VALUE!"},0,{"$error":"#VALUE!"},{"$error":"#VALUE!"},0,{"$error":"#VALUE!"},{"$f":"IF(S1043<='Collection System Summary_Table'!$I$8,\"Yes\",\"NO\")","v":"Yes"}]
[null,null,null,null,null,null,null,null,null,null,null,null,0,{"$error":"#VALUE!"},{"$error":"#VALUE!"},0,{"$error":"#VALUE!"},{"$error":"#VALUE!"},0,{"$error":"#VALUE!"},{"$f":"IF(S1044<='Collection System Summary_Table'!$I$8,\"Yes\",\"NO\")","v":"Yes"}]
[null,null,null,null,null,null,null,null,null,null,null,null,0,{"$error":"#VALUE!"},{"$error":"#VALUE!"},0,{"$error":"#VALUE!"},{"$error":"#VALUE!"},0,{"$error":"#VALUE!"},{"$f":"IF(S1045<='Collection System Summary_Table'!$I$8,\"Yes\",\"NO\")","v":"Yes"}]
[null,null,null,null,null,null,null,null,null,null,null,null,0,{"$error":"#VALUE!"},{"$error":"#VALUE!"},0,{"$error":"#VALUE!"},{"$error":"#VALUE!"},0,{"$error":"#VALUE!"},{"$f":"IF(S1046<='Collection System Summary_Table'!$I$8,\"Yes\",\"NO\")","v":"Yes"}]
[null,null,null,null,null,null,null,null,null,null,null,null,0,{"$error":"#VALUE!"},{"$error":"#VALUE!"},0,{"$error":"#VALUE!"},{"$error":"#VALUE!"},0,{"$error":"#VALUE!"},{"$f":"IF(S1047<='Collection System Summary_Table'!$I$8,\"Yes\",\"NO\")","v":"Yes"}]
[null,null,null,null,null,null,null,null,null,null,null,null,0,{"$error":"#VALUE!"},{"$error":"#VALUE!"},0,{"$error":"#VALUE!"},{"$error":"#VALUE!"},0,{"$error":"#VALUE!"},{"$f":"IF(S1048<='Collection System Summary_Table'!$I$8,\"Yes\",\"NO\")","v":"Yes"}]
[null,null,null,null,null,null,null,null,null,null,null,null,0,{"$error":"#VALUE!"},{"$error":"#VALUE!"},0,{"$error":"#VALUE!"},{"$error":"#VALUE!"},0,{"$error":"#VALUE!"},{"$f":"IF(S1049<='Collection System Summary_Table'!$I$8,\"Yes\",\"NO\")","v":"Yes"}]
[null,null,null,null,null,null,null,null,null,null,null,null,0,{"$error":"#VALUE!"},{"$error":"#VALUE!"},0,{"$error":"#VALUE!"},{"$error":"#VALUE!"},0,{"$error":"#VALUE!"},{"$f":"IF(S1050<='Collection System Summary_Table'!$I$8,\"Yes\",\"NO\")","v":"Yes"}]
[null,null,null,null,null,null,null,null,null,null,null,null,0,{"$error":"#VALUE!"},{"$error":"#VALUE!"},0,{"$error":"#VALUE!"},{"$error":"#VALUE!"},0,{"$error":"#VALUE!"},{"$f":"IF(S1051<='Collection System Summary_Table'!$I$8,\"Yes\",\"NO\")","v":"Yes"}]
[null,null,null,null,null,null,null,null,null,null,null,null,0,{"$error":"#VALUE!"},{"$error":"#VALUE!"},0,{"$error":"#VALUE!"},{"$error":"#VALUE!"},0,{"$error":"#VALUE!"},{"$f":"IF(S1052<='Collection System Summary_Table'!$I$8,\"Yes\",\"NO\")","v":"Yes"}]
[null,null,null,null,null,null,null,null,null,null,null,null,0,{"$error":"#VALUE!"},{"$error":"#VALUE!"},0,{"$error":"#VALUE!"},{"$error":"#VALUE!"},0,{"$error":"#VALUE!"},{"$f":"IF(S1053<='Collection System Summary_Table'!$I$8,\"Yes\",\"NO\")","v":"Yes"}]
[null,null,null,null,null,null,null,null,null,null,null,null,0,{"$error":"#VALUE!"},{"$error":"#VALUE!"},0,{"$error":"#VALUE!"},{"$error":"#VALUE!"},0,{"$error":"#VALUE!"},{"$f":"IF(S1054<='Collection System Summary_Table'!$I$8,\"Yes\",\"NO\")","v":"Yes"}]
[null,null,null,null,null,null,null,null,null,null,null,null,0,{"$error":"#VALUE!"},{"$error":"#VALUE!"},0,{"$error":"#VALUE!"},{"$error":"#VALUE!"},0,{"$error":"#VALUE!"},{"$f":"IF(S1055<='Collection System Summary_Table'!$I$8,\"Yes\",\"NO\")","v":"Yes"}]
[null,null,null,null,null,null,null,null,null,null,null,null,0,{"$error":"#VALUE!"},{"$error":"#VALUE!"},0,{"$error":"#VALUE!"},{"$error":"#VALUE!"},0,{"$error":"#VALUE!"},{"$f":"IF(S1056<='Collection System Summary_Table'!$I$8,\"Yes\",\"NO\")","v":"Yes"}]
[null,null,null,null,null,null,null,null,null,null,null,null,0,{"$error":"#VALUE!"},{"$error":"#VALUE!"},0,{"$error":"#VALUE!"},{"$error":"#VALUE!"},0,{"$error":"#VALUE!"},{"$f":"IF(S1057<='Collection System Summary_Table'!$I$8,\"Yes\",\"NO\")","v":"Yes"}]
[null,null,null,null,null,null,null,null,null,null,null,null,0,{"$error":"#VALUE!"},{"$error":"#VALUE!"},0,{"$error":"#VALUE!"},{"$error":"#VALUE!"},0,{"$error":"#VALUE!"},{"$f":"IF(S1058<='Collection System Summary_Table'!$I$8,\"Yes\",\"NO\")","v":"Yes"}]
[null,null,null,null,null,null,null,null,null,null,null,null,0,{"$error":"#VALUE!"},{"$error":"#VALUE!"},0,{"$error":"#VALUE!"},{"$error":"#VALUE!"},0,{"$error":"#VALUE!"},{"$f":"IF(S1059<='Collection System Summary_Table'!$I$8,\"Yes\",\"NO\")","v":"Yes"}]
[null,null,null,null,null,null,null,null,null,null,null,null,0,{"$error":"#VALUE!"},{"$error":"#VALUE!"},0,{"$error":"#VALUE!"},{"$error":"#VALUE!"},0,{"$error":"#VALUE!"},{"$f":"IF(S1060<='Collection System Summary_Table'!$I$8,\"Yes\",\"NO\")","v":"Yes"}]
[null,null,null,null,null,null,null,null,null,null,null,null,0,{"$error":"#VALUE!"},{"$error":"#VALUE!"},0,{"$error":"#VALUE!"},{"$error":"#VALUE!"},0,{"$error":"#VALUE!"},{"$f":"IF(S1061<='Collection System Summary_Table'!$I$8,\"Yes\",\"NO\")","v":"Yes"}]
[null,null,null,null,null,null,null,null,null,null,null,null,0,{"$error":"#VALUE!"},{"$error":"#VALUE!"},0,{"$error":"#VALUE!"},{"$error":"#VALUE!"},0,{"$error":"#VALUE!"},{"$f":"IF(S1062<='Collection System Summary_Table'!$I$8,\"Yes\",\"NO\")","v":"Yes"}]
[null,null,null,null,null,null,null,null,null,null,null,null,0,{"$error":"#VALUE!"},{"$error":"#VALUE!"},0,{"$error":"#VALUE!"},{"$error":"#VALUE!"},0,{"$error":"#VALUE!"},{"$f":"IF(S1063<='Collection System Summary_Table'!$I$8,\"Yes\",\"NO\")","v":"Yes"}]
[null,null,null,null,null,null,null,null,null,null,null,null,0,{"$error":"#VALUE!"},{"$error":"#VALUE!"},0,{"$error":"#VALUE!"},{"$error":"#VALUE!"},0,{"$error":"#VALUE!"},{"$f":"IF(S1064<='Collection System Summary_Table'!$I$8,\"Yes\",\"NO\")","v":"Yes"}]
[null,null,null,null,null,null,null,null,null,null,null,null,0,{"$error":"#VALUE!"},{"$error":"#VALUE!"},0,{"$error":"#VALUE!"},{"$error":"#VALUE!"},0,{"$error":"#VALUE!"},{"$f":"IF(S1065<='Collection System Summary_Table'!$I$8,\"Yes\",\"NO\")","v":"Yes"}]
[null,null,null,null,null,null,null,null,null,null,null,null,0,{"$error":"#VALUE!"},{"$error":"#VALUE!"},0,{"$error":"#VALUE!"},{"$error":"#VALUE!"},0,{"$error":"#VALUE!"},{"$f":"IF(S1066<='Collection System Summary_Table'!$I$8,\"Yes\",\"NO\")","v":"Yes"}]
[null,null,null,null,null,null,null,null,null,null,null,null,0,{"$error":"#VALUE!"},{"$error":"#VALUE!"},0,{"$error":"#VALUE!"},{"$error":"#VALUE!"},0,{"$error":"#VALUE!"},{"$f":"IF(S1067<='Collection System Summary_Table'!$I$8,\"Yes\",\"NO\")","v":"Yes"}]
[null,null,null,null,null,null,null,null,null,null,null,null,0,{"$error":"#VALUE!"},{"$error":"#VALUE!"},0,{"$error":"#VALUE!"},{"$error":"#VALUE!"},0,{"$error":"#VALUE!"},{"$f":"IF(S1068<='Collection System Summary_Table'!$I$8,\"Yes\",\"NO\")","v":"Yes"}]
[null,null,null,null,null,null,null,null,null,null,null,null,0,{"$error":"#VALUE!"},{"$error":"#VALUE!"},0,{"$error":"#VALUE!"},{"$error":"#VALUE!"},0,{"$error":"#VALUE!"},{"$f":"IF(S1069<='Collection System Summary_Table'!$I$8,\"Yes\",\"NO\")","v":"Yes"}]
[null,null,null,null,null,null,null,null,null,null,null,null,0,{"$error":"#VALUE!"},{"$error":"#VALUE!"},0,{"$error":"#VALUE!"},{"$error":"#VALUE!"},0,{"$error":"#VALUE!"},{"$f":"IF(S1070<='Collection System Summary_Table'!$I$8,\"Yes\",\"NO\")","v":"Yes"}]
[null,null,null,null,null,null,null,null,null,null,null,null,0,{"$error":"#VALUE!"},{"$error":"#VALUE!"},0,{"$error":"#VALUE!"},{"$error":"#VALUE!"},0,{"$error":"#VALUE!"},{"$f":"IF(S1071<='Collection System Summary_Table'!$I$8,\"Yes\",\"NO\")","v":"Yes"}]
[null,null,null,null,null,null,null,null,null,null,null,null,0,{"$error":"#VALUE!"},{"$error":"#VALUE!"},0,{"$error":"#VALUE!"},{"$error":"#VALUE!"},0,{"$error":"#VALUE!"},{"$f":"IF(S1072<='Collection System Summary_Table'!$I$8,\"Yes\",\"NO\")","v":"Yes"}]
[null,null,null,null,null,null,null,null,null,null,null,null,0,{"$error":"#VALUE!"},{"$error":"#VALUE!"},0,{"$error":"#VALUE!"},{"$error":"#VALUE!"},0,{"$error":"#VALUE!"},{"$f":"IF(S1073<='Collection System Summary_Table'!$I$8,\"Yes\",\"NO\")","v":"Yes"}]
[null,null,null,null,null,null,null,null,null,null,null,null,0,{"$error":"#VALUE!"},{"$error":"#VALUE!"},0,{"$error":"#VALUE!"},{"$error":"#VALUE!"},0,{"$error":"#VALUE!"},{"$f":"IF(S1074<='Collection System Summary_Table'!$I$8,\"Yes\",\"NO\")","v":"Yes"}]
[null,null,null,null,null,null,null,null,null,null,null,null,0,{"$error":"#VALUE!"},{"$error":"#VALUE!"},0,{"$error":"#VALUE!"},{"$error":"#VALUE!"},0,{"$error":"#VALUE!"},{"$f":"IF(S1075<='Collection System Summary_Table'!$I$8,\"Yes\",\"NO\")","v":"Yes"}]
[null,null,null,null,null,null,null,null,null,null,null,null,0,{"$error":"#VALUE!"},{"$error":"#VALUE!"},0,{"$error":"#VALUE!"},{"$error":"#VALUE!"},0,{"$error":"#VALUE!"},{"$f":"IF(S1076<='Collection System Summary_Table'!$I$8,\"Yes\",\"NO\")","v":"Yes"}]
[null,null,null,null,null,null,null,null,null,null,null,null,0,{"$error":"#VALUE!"},{"$error":"#VALUE!"},0,{"$error":"#VALUE!"},{"$error":"#VALUE!"},0,{"$error":"#VALUE!"},{"$f":"IF(S1077<='Collection System Summary_Table'!$I$8,\"Yes\",\"NO\")","v":"Yes"}]
[null,null,null,null,null,null,null,null,null,null,null,null,0,{"$error":"#VALUE!"},{"$error":"#VALUE!"},0,{"$error":"#VALUE!"},{"$error":"#VALUE!"},0,{"$error":"#VALUE!"},{"$f":"IF(S1078<='Collection System Summary_Table'!$I$8,\"Yes\",\"NO\")","v":"Yes"}]
[null,null,null,null,null,null,null,null,null,null,null,null,0,{"$error":"#VALUE!"},{"$error":"#VALUE!"},0,{"$error":"#VALUE!"},{"$error":"#VALUE!"},0,{"$error":"#VALUE!"},{"$f":"IF(S1079<='Collection System Summary_Table'!$I$8,\"Yes\",\"NO\")","v":"Yes"}]
[null,null,null,null,null,null,null,null,null,null,null,null,0,{"$error":"#VALUE!"},{"$error":"#VALUE!"},0,{"$error":"#VALUE!"},{"$error":"#VALUE!"},0,{"$error":"#VALUE!"},{"$f":"IF(S1080<='Collection System Summary_Table'!$I$8,\"Yes\",\"NO\")","v":"Yes"}]
[null,null,null,null,null,null,null,null,null,null,null,null,0,{"$error":"#VALUE!"},{"$error":"#VALUE!"},0,{"$error":"#VALUE!"},{"$error":"#VALUE!"},0,{"$error":"#VALUE!"},{"$f":"IF(S1081<='Collection System Summary_Table'!$I$8,\"Yes\",\"NO\")","v":"Yes"}]
[null,null,null,null,null,null,null,null,null,null,null,null,0,{"$error":"#VALUE!"},{"$error":"#VALUE!"},0,{"$error":"#VALUE!"},{"$error":"#VALUE!"},0,{"$error":"#VALUE!"},{"$f":"IF(S1082<='Collection System Summary_Table'!$I$8,\"Yes\",\"NO\")","v":"Yes"}]
[null,null,null,null,null,null,null,null,null,null,null,null,0,{"$error":"#VALUE!"},{"$error":"#VALUE!"},0,{"$error":"#VALUE!"},{"$error":"#VALUE!"},0,{"$error":"#VALUE!"},{"$f":"IF(S1083<='Collection System Summary_Table'!$I$8,\"Yes\",\"NO\")","v":"Yes"}]
[null,null,null,null,null,null,null,null,null,null,null,null,0,{"$error":"#VALUE!"},{"$error":"#VALUE!"},0,{"$error":"#VALUE!"},{"$error":"#VALUE!"},0,{"$error":"#VALUE!"},{"$f":"IF(S1084<='Collection System Summary_Table'!$I$8,\"Yes\",\"NO\")","v":"Yes"}]
[null,null,null,null,null,null,null,null,null,null,null,null,0,{"$error":"#VALUE!"},{"$error":"#VALUE!"},0,{"$error":"#VALUE!"},{"$error":"#VALUE!"},0,{"$error":"#VALUE!"},{"$f":"IF(S1085<='Collection System Summary_Table'!$I$8,\"Yes\",\"NO\")","v":"Yes"}]
[null,null,null,null,null,null,null,null,null,null,null,null,0,{"$error":"#VALUE!"},{"$error":"#VALUE!"},0,{"$error":"#VALUE!"},{"$error":"#VALUE!"},0,{"$error":"#VALUE!"},{"$f":"IF(S1086<='Collection System Summary_Table'!$I$8,\"Yes\",\"NO\")","v":"Yes"}]
[null,null,null,null,null,null,null,null,null,null,null,null,0,{"$error":"#VALUE!"},{"$error":"#VALUE!"},0,{"$error":"#VALUE!"},{"$error":"#VALUE!"},0,{"$error":"#VALUE!"},{"$f":"IF(S1087<='Collection System Summary_Table'!$I$8,\"Yes\",\"NO\")","v":"Yes"}]
[null,null,null,null,null,null,null,null,null,null,null,null,0,{"$error":"#VALUE!"},{"$error":"#VALUE!"},0,{"$error":"#VALUE!"},{"$error":"#VALUE!"},0,{"$error":"#VALUE!"},{"$f":"IF(S1088<='Collection System Summary_Table'!$I$8,\"Yes\",\"NO\")","v":"Yes"}]
[null,null,null,null,null,null,null,null,null,null,null,null,0,{"$error":"#VALUE!"},{"$error":"#VALUE!"},0,{"$error":"#VALUE!"},{"$error":"#VALUE!"},0,{"$error":"#VALUE!"},{"$f":"IF(S1089<='Collection System Summary_Table'!$I$8,\"Yes\",\"NO\")","v":"Yes"}]
[null,null,null,null,null,null,null,null,null,null,null,null,0,{"$error":"#VALUE!"},{"$error":"#VALUE!"},0,{"$error":"#VALUE!"},{"$error":"#VALUE!"},0,{"$error":"#VALUE!"},{"$f":"IF(S1090<='Collection System Summary_Table'!$I$8,\"Yes\",\"NO\")","v":"Yes"}]
[null,null,null,null,null,null,null,null,null,null,null,null,0,{"$f":"IF(P1091=0,I1091+N1090,0)","v":{"$error":"#VALUE!"}},{"$error":"#VALUE!"},0,{"$error":"#VALUE!"},{"$error":"#VALUE!"},0,{"$error":"#VALUE!"},{"$f":"IF(S1091<='Collection System Summary_Table'!$I$8,\"Yes\",\"NO\")","v":"Yes"}]
[null,null,null,null,null,null,null,null,null,null,null,null,0,{"$error":"#VALUE!"},{"$f":"IF(AND(Q1092=0,P1092=0),K1092+O1091,0)","v":{"$error":"#VALUE!"}},0,{"$f":"IF(AND(P1092=0,N1092<($B$4+$P$1)),J1092,0)","v":{"$error":"#VALUE!"}},{"$f":"IF(AND(P1092=0,Q1092=0,O1092<($B$5+$Q$1)),K1092,0)","v":{"$error":"#VALUE!"}},{"$f":"S1091+L1092","v":0},{"$f":"IF(OR(P1092>1,Q1092>1,R1092>1),\"YES\",\"NO\")","v":{"$error":"#VALUE!"}},{"$f":"IF(S1092<='Collection System Summary_Table'!$I$8,\"Yes\",\"NO\")","v":"Yes"}]
[null,null,null,null,null,null,null,null,null,null,null,null,{"$f":"M1092+I1093","v":0},{"$error":"#VALUE!"},{"$error":"#VALUE!"},{"$f":"IF(M1093<=$B$3,I1093,0)","v":0},{"$error":"#VALUE!"},{"$error":"#VALUE!"},0,{"$error":"#VALUE!"},{"$f":"IF(S1093<='Collection System Summary_Table'!$I$8,\"Yes\",\"NO\")","v":"Yes"}]
[null,null,null,null,null,null,null,null,null,null,null,null,0,{"$error":"#VALUE!"},{"$error":"#VALUE!"},0,{"$error":"#VALUE!"},{"$error":"#VALUE!"},0,{"$error":"#VALUE!"},{"$f":"IF(S1094<='Collection System Summary_Table'!$I$8,\"Yes\",\"NO\")","v":"Yes"}]
[null,null,null,null,null,null,null,null,null,null,null,null,0,{"$error":"#VALUE!"},{"$error":"#VALUE!"},0,{"$error":"#VALUE!"},{"$error":"#VALUE!"},0,{"$error":"#VALUE!"},{"$f":"IF(S1095<='Collection System Summary_Table'!$I$8,\"Yes\",\"NO\")","v":"Yes"}]
[null,null,null,null,null,null,null,null,null,null,null,null,0,{"$error":"#VALUE!"},{"$error":"#VALUE!"},0,{"$error":"#VALUE!"},{"$error":"#VALUE!"},0,{"$error":"#VALUE!"},{"$f":"IF(S1096<='Collection System Summary_Table'!$I$8,\"Yes\",\"NO\")","v":"Yes"}]
[null,null,null,null,null,null,null,null,null,null,null,null,0,{"$error":"#VALUE!"},{"$error":"#VALUE!"},0,{"$error":"#VALUE!"},{"$error":"#VALUE!"},0,{"$error":"#VALUE!"},{"$f":"IF(S1097<='Collection System Summary_Table'!$I$8,\"Yes\",\"NO\")","v":"Yes"}]
[null,null,null,null,null,null,null,null,null,null,null,null,0,{"$error":"#VALUE!"},{"$error":"#VALUE!"},0,{"$error":"#VALUE!"},{"$error":"#VALUE!"},0,{"$error":"#VALUE!"},{"$f":"IF(S1098<='Collection System Summary_Table'!$I$8,\"Yes\",\"NO\")","v":"Yes"}]
[null,null,null,null,null,null,null,null,null,null,null,null,0,{"$error":"#VALUE!"},{"$error":"#VALUE!"},0,{"$error":"#VALUE!"},{"$error":"#VALUE!"},0,{"$error":"#VALUE!"},{"$f":"IF(S1099<='Collection System Summary_Table'!$I$8,\"Yes\",\"NO\")","v":"Yes"}]
[null,null,null,null,null,null,null,null,null,null,null,null,0,{"$error":"#VALUE!"},{"$error":"#VALUE!"},0,{"$error":"#VALUE!"},{"$error":"#VALUE!"},0,{"$error":"#VALUE!"},{"$f":"IF(S1100<='Collection System Summary_Table'!$I$8,\"Yes\",\"NO\")","v":"Yes"}]
[null,null,null,null,null,null,null,null,null,null,null,null,0,{"$error":"#VALUE!"},{"$error":"#VALUE!"},0,{"$error":"#VALUE!"},{"$error":"#VALUE!"},0,{"$error":"#VALUE!"},{"$f":"IF(S1101<='Collection System Summary_Table'!$I$8,\"Yes\",\"NO\")","v":"Yes"}]
[null,null,null,null,null,null,null,null,null,null,null,null,0,{"$error":"#VALUE!"},{"$error":"#VALUE!"},0,{"$error":"#VALUE!"},{"$error":"#VALUE!"},0,{"$error":"#VALUE!"},{"$f":"IF(S1102<='Collection System Summary_Table'!$I$8,\"Yes\",\"NO\")","v":"Yes"}]
[null,null,null,null,null,null,null,null,null,null,null,null,0,{"$error":"#VALUE!"},{"$error":"#VALUE!"},0,{"$error":"#VALUE!"},{"$error":"#VALUE!"},0,{"$error":"#VALUE!"},{"$f":"IF(S1103<='Collection System Summary_Table'!$I$8,\"Yes\",\"NO\")","v":"Yes"}]
[null,null,null,null,null,null,null,null,null,null,null,null,0,{"$error":"#VALUE!"},{"$error":"#VALUE!"},0,{"$error":"#VALUE!"},{"$error":"#VALUE!"},0,{"$error":"#VALUE!"},{"$f":"IF(S1104<='Collection System Summary_Table'!$I$8,\"Yes\",\"NO\")","v":"Yes"}]
[null,null,null,null,null,null,null,null,null,null,null,null,0,{"$error":"#VALUE!"},{"$error":"#VALUE!"},0,{"$error":"#VALUE!"},{"$error":"#VALUE!"},0,{"$error":"#VALUE!"},{"$f":"IF(S1105<='Collection System Summary_Table'!$I$8,\"Yes\",\"NO\")","v":"Yes"}]
[null,null,null,null,null,null,null,null,null,null,null,null,0,{"$error":"#VALUE!"},{"$error":"#VALUE!"},0,{"$error":"#VALUE!"},{"$error":"#VALUE!"},0,{"$error":"#VALUE!"},{"$f":"IF(S1106<='Collection System Summary_Table'!$I$8,\"Yes\",\"NO\")","v":"Yes"}]
[null,null,null,null,null,null,null,null,null,null,null,null,0,{"$error":"#VALUE!"},{"$error":"#VALUE!"},0,{"$error":"#VALUE!"},{"$error":"#VALUE!"},0,{"$error":"#VALUE!"},{"$f":"IF(S1107<='Collection System Summary_Table'!$I$8,\"Yes\",\"NO\")","v":"Yes"}]
[null,null,null,null,null,null,null,null,null,null,null,null,0,{"$error":"#VALUE!"},{"$error":"#VALUE!"},0,{"$error":"#VALUE!"},{"$error":"#VALUE!"},0,{"$error":"#VALUE!"},{"$f":"IF(S1108<='Collection System Summary_Table'!$I$8,\"Yes\",\"NO\")","v":"Yes"}]
[null,null,null,null,null,null,null,null,null,null,null,null,0,{"$error":"#VALUE!"},{"$error":"#VALUE!"},0,{"$error":"#VALUE!"},{"$error":"#VALUE!"},0,{"$error":"#VALUE!"},{"$f":"IF(S1109<='Collection System Summary_Table'!$I$8,\"Yes\",\"NO\")","v":"Yes"}]
[null,null,null,null,null,null,null,null,null,null,null,null,0,{"$error":"#VALUE!"},{"$error":"#VALUE!"},0,{"$error":"#VALUE!"},{"$error":"#VALUE!"},0,{"$error":"#VALUE!"},{"$f":"IF(S1110<='Collection System Summary_Table'!$I$8,\"Yes\",\"NO\")","v":"Yes"}]
[null,null,null,null,null,null,null,null,null,null,null,null,0,{"$error":"#VALUE!"},{"$error":"#VALUE!"},0,{"$error":"#VALUE!"},{"$error":"#VALUE!"},0,{"$error":"#VALUE!"},{"$f":"IF(S1111<='Collection System Summary_Table'!$I$8,\"Yes\",\"NO\")","v":"Yes"}]
[null,null,null,null,null,null,null,null,null,null,null,null,0,{"$error":"#VALUE!"},{"$error":"#VALUE!"},0,{"$error":"#VALUE!"},{"$error":"#VALUE!"},0,{"$error":"#VALUE!"},{"$f":"IF(S1112<='Collection System Summary_Table'!$I$8,\"Yes\",\"NO\")","v":"Yes"}]
[null,null,null,null,null,null,null,null,null,null,null,null,0,{"$error":"#VALUE!"},{"$error":"#VALUE!"},0,{"$error":"#VALUE!"},{"$error":"#VALUE!"},0,{"$error":"#VALUE!"},{"$f":"IF(S1113<='Collection System Summary_Table'!$I$8,\"Yes\",\"NO\")","v":"Yes"}]
[null,null,null,null,null,null,null,null,null,null,null,null,0,{"$error":"#VALUE!"},{"$error":"#VALUE!"},0,{"$error":"#VALUE!"},{"$error":"#VALUE!"},0,{"$error":"#VALUE!"},{"$f":"IF(S1114<='Collection System Summary_Table'!$I$8,\"Yes\",\"NO\")","v":"Yes"}]
[null,null,null,null,null,null,null,null,null,null,null,null,0,{"$error":"#VALUE!"},{"$error":"#VALUE!"},0,{"$error":"#VALUE!"},{"$error":"#VALUE!"},0,{"$error":"#VALUE!"},{"$f":"IF(S1115<='Collection System Summary_Table'!$I$8,\"Yes\",\"NO\")","v":"Yes"}]
[null,null,null,null,null,null,null,null,null,null,null,null,0,{"$error":"#VALUE!"},{"$error":"#VALUE!"},0,{"$error":"#VALUE!"},{"$error":"#VALUE!"},0,{"$error":"#VALUE!"},{"$f":"IF(S1116<='Collection System Summary_Table'!$I$8,\"Yes\",\"NO\")","v":"Yes"}]
[null,null,null,null,null,null,null,null,null,null,null,null,0,{"$error":"#VALUE!"},{"$error":"#VALUE!"},0,{"$error":"#VALUE!"},{"$error":"#VALUE!"},0,{"$error":"#VALUE!"},{"$f":"IF(S1117<='Collection System Summary_Table'!$I$8,\"Yes\",\"NO\")","v":"Yes"}]
[null,null,null,null,null,null,null,null,null,null,null,null,0,{"$error":"#VALUE!"},{"$error":"#VALUE!"},0,{"$error":"#VALUE!"},{"$error":"#VALUE!"},0,{"$error":"#VALUE!"},{"$f":"IF(S1118<='Collection System Summary_Table'!$I$8,\"Yes\",\"NO\")","v":"Yes"}]
[null,null,null,null,null,null,null,null,null,null,null,null,0,{"$error":"#VALUE!"},{"$error":"#VALUE!"},0,{"$error":"#VALUE!"},{"$error":"#VALUE!"},0,{"$error":"#VALUE!"},{"$f":"IF(S1119<='Collection System Summary_Table'!$I$8,\"Yes\",\"NO\")","v":"Yes"}]
[null,null,null,null,null,null,null,null,null,null,null,null,0,{"$error":"#VALUE!"},{"$error":"#VALUE!"},0,{"$error":"#VALUE!"},{"$error":"#VALUE!"},0,{"$error":"#VALUE!"},{"$f":"IF(S1120<='Collection System Summary_Table'!$I$8,\"Yes\",\"NO\")","v":"Yes"}]
[null,null,null,null,null,null,null,null,null,null,null,null,0,{"$error":"#VALUE!"},{"$error":"#VALUE!"},0,{"$error":"#VALUE!"},{"$error":"#VALUE!"},0,{"$error":"#VALUE!"},{"$f":"IF(S1121<='Collection System Summary_Table'!$I$8,\"Yes\",\"NO\")","v":"Yes"}]
[null,null,null,null,null,null,null,null,null,null,null,null,0,{"$error":"#VALUE!"},{"$error":"#VALUE!"},0,{"$error":"#VALUE!"},{"$error":"#VALUE!"},0,{"$error":"#VALUE!"},{"$f":"IF(S1122<='Collection System Summary_Table'!$I$8,\"Yes\",\"NO\")","v":"Yes"}]
[null,null,null,null,null,null,null,null,null,null,null,null,0,{"$error":"#VALUE!"},{"$error":"#VALUE!"},0,{"$error":"#VALUE!"},{"$error":"#VALUE!"},0,{"$error":"#VALUE!"},{"$f":"IF(S1123<='Collection System Summary_Table'!$I$8,\"Yes\",\"NO\")","v":"Yes"}]
[null,null,null,null,null,null,null,null,null,null,null,null,0,{"$error":"#VALUE!"},{"$error":"#VALUE!"},0,{"$error":"#VALUE!"},{"$error":"#VALUE!"},0,{"$error":"#VALUE!"},{"$f":"IF(S1124<='Collection System Summary_Table'!$I$8,\"Yes\",\"NO\")","v":"Yes"}]
[null,null,null,null,null,null,null,null,null,null,null,null,0,{"$error":"#VALUE!"},{"$error":"#VALUE!"},0,{"$error":"#VALUE!"},{"$error":"#VALUE!"},0,{"$error":"#VALUE!"},{"$f":"IF(S1125<='Collection System Summary_Table'!$I$8,\"Yes\",\"NO\")","v":"Yes"}]
[null,null,null,null,null,null,null,null,null,null,null,null,0,{"$error":"#VALUE!"},{"$error":"#VALUE!"},0,{"$error":"#VALUE!"},{"$error":"#VALUE!"},0,{"$error":"#VALUE!"},{"$f":"IF(S1126<='Collection System Summary_Table'!$I$8,\"Yes\",\"NO\")","v":"Yes"}]
[null,null,null,null,null,null,null,null,null,null,null,null,0,{"$error":"#VALUE!"},{"$error":"#VALUE!"},0,{"$error":"#VALUE!"},{"$error":"#VALUE!"},0,{"$error":"#VALUE!"},{"$f":"IF(S1127<='Collection System Summary_Table'!$I$8,\"Yes\",\"NO\")","v":"Yes"}]
[null,null,null,null,null,null,null,null,null,null,null,null,0,{"$error":"#VALUE!"},{"$error":"#VALUE!"},0,{"$error":"#VALUE!"},{"$error":"#VALUE!"},0,{"$error":"#VALUE!"},{"$f":"IF(S1128<='Collection System Summary_Table'!$I$8,\"Yes\",\"NO\")","v":"Yes"}]
[null,null,null,null,null,null,null,null,null,null,null,null,0,{"$error":"#VALUE!"},{"$error":"#VALUE!"},0,{"$error":"#VALUE!"},{"$error":"#VALUE!"},0,{"$error":"#VALUE!"},{"$f":"IF(S1129<='Collection System Summary_Table'!$I$8,\"Yes\",\"NO\")","v":"Yes"}]
[null,null,null,null,null,null,null,null,null,null,null,null,0,{"$error":"#VALUE!"},{"$error":"#VALUE!"},0,{"$error":"#VALUE!"},{"$error":"#VALUE!"},0,{"$error":"#VALUE!"},{"$f":"IF(S1130<='Collection System Summary_Table'!$I$8,\"Yes\",\"NO\")","v":"Yes"}]
[null,null,null,null,null,null,null,null,null,null,null,null,0,{"$error":"#VALUE!"},{"$error":"#VALUE!"},0,{"$error":"#VALUE!"},{"$error":"#VALUE!"},0,{"$error":"#VALUE!"},{"$f":"IF(S1131<='Collection System Summary_Table'!$I$8,\"Yes\",\"NO\")","v":"Yes"}]
[null,null,null,null,null,null,null,null,null,null,null,null,0,{"$error":"#VALUE!"},{"$error":"#VALUE!"},0,{"$error":"#VALUE!"},{"$error":"#VALUE!"},0,{"$error":"#VALUE!"},{"$f":"IF(S1132<='Collection System Summary_Table'!$I$8,\"Yes\",\"NO\")","v":"Yes"}]
[null,null,null,null,null,null,null,null,null,null,null,null,0,{"$error":"#VALUE!"},{"$error":"#VALUE!"},0,{"$error":"#VALUE!"},{"$error":"#VALUE!"},0,{"$error":"#VALUE!"},{"$f":"IF(S1133<='Collection System Summary_Table'!$I$8,\"Yes\",\"NO\")","v":"Yes"}]
[null,null,null,null,null,null,null,null,null,null,null,null,0,{"$error":"#VALUE!"},{"$error":"#VALUE!"},0,{"$error":"#VALUE!"},{"$error":"#VALUE!"},0,{"$error":"#VALUE!"},{"$f":"IF(S1134<='Collection System Summary_Table'!$I$8,\"Yes\",\"NO\")","v":"Yes"}]
[null,null,null,null,null,null,null,null,null,null,null,null,0,{"$error":"#VALUE!"},{"$error":"#VALUE!"},0,{"$error":"#VALUE!"},{"$error":"#VALUE!"},0,{"$error":"#VALUE!"},{"$f":"IF(S1135<='Collection System Summary_Table'!$I$8,\"Yes\",\"NO\")","v":"Yes"}]
[null,null,null,null,null,null,null,null,null,null,null,null,0,{"$error":"#VALUE!"},{"$error":"#VALUE!"},0,{"$error":"#VALUE!"},{"$error":"#VALUE!"},0,{"$error":"#VALUE!"},{"$f":"IF(S1136<='Collection System Summary_Table'!$I$8,\"Yes\",\"NO\")","v":"Yes"}]
[null,null,null,null,null,null,null,null,null,null,null,null,0,{"$error":"#VALUE!"},{"$error":"#VALUE!"},0,{"$error":"#VALUE!"},{"$error":"#VALUE!"},0,{"$error":"#VALUE!"},{"$f":"IF(S1137<='Collection System Summary_Table'!$I$8,\"Yes\",\"NO\")","v":"Yes"}]
[null,null,null,null,null,null,null,null,null,null,null,null,0,{"$error":"#VALUE!"},{"$error":"#VALUE!"},0,{"$error":"#VALUE!"},{"$error":"#VALUE!"},0,{"$error":"#VALUE!"},{"$f":"IF(S1138<='Collection System Summary_Table'!$I$8,\"Yes\",\"NO\")","v":"Yes"}]
[null,null,null,null,null,null,null,null,null,null,null,null,0,{"$error":"#VALUE!"},{"$error":"#VALUE!"},0,{"$error":"#VALUE!"},{"$error":"#VALUE!"},0,{"$error":"#VALUE!"},{"$f":"IF(S1139<='Collection System Summary_Table'!$I$8,\"Yes\",\"NO\")","v":"Yes"}]
[null,null,null,null,null,null,null,null,null,null,null,null,0,{"$error":"#VALUE!"},{"$error":"#VALUE!"},0,{"$error":"#VALUE!"},{"$error":"#VALUE!"},0,{"$error":"#VALUE!"},{"$f":"IF(S1140<='Collection System Summary_Table'!$I$8,\"Yes\",\"NO\")","v":"Yes"}]
[null,null,null,null,null,null,null,null,null,null,null,null,0,{"$error":"#VALUE!"},{"$error":"#VALUE!"},0,{"$error":"#VALUE!"},{"$error":"#VALUE!"},0,{"$error":"#VALUE!"},{"$f":"IF(S1141<='Collection System Summary_Table'!$I$8,\"Yes\",\"NO\")","v":"Yes"}]
[null,null,null,null,null,null,null,null,null,null,null,null,0,{"$error":"#VALUE!"},{"$error":"#VALUE!"},0,{"$error":"#VALUE!"},{"$error":"#VALUE!"},0,{"$error":"#VALUE!"},{"$f":"IF(S1142<='Collection System Summary_Table'!$I$8,\"Yes\",\"NO\")","v":"Yes"}]
[null,null,null,null,null,null,null,null,null,null,null,null,0,{"$error":"#VALUE!"},{"$error":"#VALUE!"},0,{"$error":"#VALUE!"},{"$error":"#VALUE!"},0,{"$error":"#VALUE!"},{"$f":"IF(S1143<='Collection System Summary_Table'!$I$8,\"Yes\",\"NO\")","v":"Yes"}]
[null,null,null,null,null,null,null,null,null,null,null,null,0,{"$error":"#VALUE!"},{"$error":"#VALUE!"},0,{"$error":"#VALUE!"},{"$error":"#VALUE!"},0,{"$error":"#VALUE!"},{"$f":"IF(S1144<='Collection System Summary_Table'!$I$8,\"Yes\",\"NO\")","v":"Yes"}]
[null,null,null,null,null,null,null,null,null,null,null,null,0,{"$error":"#VALUE!"},{"$error":"#VALUE!"},0,{"$error":"#VALUE!"},{"$error":"#VALUE!"},0,{"$error":"#VALUE!"},{"$f":"IF(S1145<='Collection System Summary_Table'!$I$8,\"Yes\",\"NO\")","v":"Yes"}]
[null,null,null,null,null,null,null,null,null,null,null,null,0,{"$error":"#VALUE!"},{"$error":"#VALUE!"},0,{"$error":"#VALUE!"},{"$error":"#VALUE!"},0,{"$error":"#VALUE!"},{"$f":"IF(S1146<='Collection System Summary_Table'!$I$8,\"Yes\",\"NO\")","v":"Yes"}]
[null,null,null,null,null,null,null,null,null,null,null,null,0,{"$error":"#VALUE!"},{"$error":"#VALUE!"},0,{"$error":"#VALUE!"},{"$error":"#VALUE!"},0,{"$error":"#VALUE!"},{"$f":"IF(S1147<='Collection System Summary_Table'!$I$8,\"Yes\",\"NO\")","v":"Yes"}]
[null,null,null,null,null,null,null,null,null,null,null,null,0,{"$error":"#VALUE!"},{"$error":"#VALUE!"},0,{"$error":"#VALUE!"},{"$error":"#VALUE!"},0,{"$error":"#VALUE!"},{"$f":"IF(S1148<='Collection System Summary_Table'!$I$8,\"Yes\",\"NO\")","v":"Yes"}]
[null,null,null,null,null,null,null,null,null,null,null,null,0,{"$error":"#VALUE!"},{"$error":"#VALUE!"},0,{"$error":"#VALUE!"},{"$error":"#VALUE!"},0,{"$error":"#VALUE!"},{"$f":"IF(S1149<='Collection System Summary_Table'!$I$8,\"Yes\",\"NO\")","v":"Yes"}]
[null,null,null,null,null,null,null,null,null,null,null,null,0,{"$error":"#VALUE!"},{"$error":"#VALUE!"},0,{"$error":"#VALUE!"},{"$error":"#VALUE!"},0,{"$error":"#VALUE!"},{"$f":"IF(S1150<='Collection System Summary_Table'!$I$8,\"Yes\",\"NO\")","v":"Yes"}]
[null,null,null,null,null,null,null,null,null,null,null,null,0,{"$error":"#VALUE!"},{"$error":"#VALUE!"},0,{"$error":"#VALUE!"},{"$error":"#VALUE!"},0,{"$error":"#VALUE!"},{"$f":"IF(S1151<='Collection System Summary_Table'!$I$8,\"Yes\",\"NO\")","v":"Yes"}]
[null,null,null,null,null,null,null,null,null,null,null,null,0,{"$error":"#VALUE!"},{"$error":"#VALUE!"},0,{"$error":"#VALUE!"},{"$error":"#VALUE!"},0,{"$error":"#VALUE!"},{"$f":"IF(S1152<='Collection System Summary_Table'!$I$8,\"Yes\",\"NO\")","v":"Yes"}]
[null,null,null,null,null,null,null,null,null,null,null,null,0,{"$error":"#VALUE!"},{"$error":"#VALUE!"},0,{"$error":"#VALUE!"},{"$error":"#VALUE!"},0,{"$error":"#VALUE!"},{"$f":"IF(S1153<='Collection System Summary_Table'!$I$8,\"Yes\",\"NO\")","v":"Yes"}]
[null,null,null,null,null,null,null,null,null,null,null,null,0,{"$error":"#VALUE!"},{"$error":"#VALUE!"},0,{"$error":"#VALUE!"},{"$error":"#VALUE!"},0,{"$error":"#VALUE!"},{"$f":"IF(S1154<='Collection System Summary_Table'!$I$8,\"Yes\",\"NO\")","v":"Yes"}]
[null,null,null,null,null,null,null,null,null,null,null,null,0,{"$f":"IF(P1155=0,I1155+N1154,0)","v":{"$error":"#VALUE!"}},{"$error":"#VALUE!"},0,{"$error":"#VALUE!"},{"$error":"#VALUE!"},0,{"$error":"#VALUE!"},{"$f":"IF(S1155<='Collection System Summary_Table'!$I$8,\"Yes\",\"NO\")","v":"Yes"}]
[null,null,null,null,null,null,null,null,null,null,null,null,0,{"$error":"#VALUE!"},{"$f":"IF(AND(Q1156=0,P1156=0),K1156+O1155,0)","v":{"$error":"#VALUE!"}},0,{"$f":"IF(AND(P1156=0,N1156<($B$4+$P$1)),J1156,0)","v":{"$error":"#VALUE!"}},{"$f":"IF(AND(P1156=0,Q1156=0,O1156<($B$5+$Q$1)),K1156,0)","v":{"$error":"#VALUE!"}},{"$f":"S1155+L1156","v":0},{"$f":"IF(OR(P1156>1,Q1156>1,R1156>1),\"YES\",\"NO\")","v":{"$error":"#VALUE!"}},{"$f":"IF(S1156<='Collection System Summary_Table'!$I$8,\"Yes\",\"NO\")","v":"Yes"}]
[null,null,null,null,null,null,null,null,null,null,null,null,{"$f":"M1156+I1157","v":0},{"$error":"#VALUE!"},{"$error":"#VALUE!"},{"$f":"IF(M1157<=$B$3,I1157,0)","v":0},{"$error":"#VALUE!"},{"$error":"#VALUE!"},0,{"$error":"#VALUE!"},{"$f":"IF(S1157<='Collection System Summary_Table'!$I$8,\"Yes\",\"NO\")","v":"Yes"}]
[null,null,null,null,null,null,null,null,null,null,null,null,0,{"$error":"#VALUE!"},{"$error":"#VALUE!"},0,{"$error":"#VALUE!"},{"$error":"#VALUE!"},0,{"$error":"#VALUE!"},{"$f":"IF(S1158<='Collection System Summary_Table'!$I$8,\"Yes\",\"NO\")","v":"Yes"}]
[null,null,null,null,null,null,null,null,null,null,null,null,0,{"$error":"#VALUE!"},{"$error":"#VALUE!"},0,{"$error":"#VALUE!"},{"$error":"#VALUE!"},0,{"$error":"#VALUE!"},{"$f":"IF(S1159<='Collection System Summary_Table'!$I$8,\"Yes\",\"NO\")","v":"Yes"}]
[null,null,null,null,null,null,null,null,null,null,null,null,0,{"$error":"#VALUE!"},{"$error":"#VALUE!"},0,{"$error":"#VALUE!"},{"$error":"#VALUE!"},0,{"$error":"#VALUE!"},{"$f":"IF(S1160<='Collection System Summary_Table'!$I$8,\"Yes\",\"NO\")","v":"Yes"}]
[null,null,null,null,null,null,null,null,null,null,null,null,0,{"$error":"#VALUE!"},{"$error":"#VALUE!"},0,{"$error":"#VALUE!"},{"$error":"#VALUE!"},0,{"$error":"#VALUE!"},{"$f":"IF(S1161<='Collection System Summary_Table'!$I$8,\"Yes\",\"NO\")","v":"Yes"}]
[null,null,null,null,null,null,null,null,null,null,null,null,0,{"$error":"#VALUE!"},{"$error":"#VALUE!"},0,{"$error":"#VALUE!"},{"$error":"#VALUE!"},0,{"$error":"#VALUE!"},{"$f":"IF(S1162<='Collection System Summary_Table'!$I$8,\"Yes\",\"NO\")","v":"Yes"}]
[null,null,null,null,null,null,null,null,null,null,null,null,0,{"$error":"#VALUE!"},{"$error":"#VALUE!"},0,{"$error":"#VALUE!"},{"$error":"#VALUE!"},0,{"$error":"#VALUE!"},{"$f":"IF(S1163<='Collection System Summary_Table'!$I$8,\"Yes\",\"NO\")","v":"Yes"}]
[null,null,null,null,null,null,null,null,null,null,null,null,0,{"$error":"#VALUE!"},{"$error":"#VALUE!"},0,{"$error":"#VALUE!"},{"$error":"#VALUE!"},0,{"$error":"#VALUE!"},{"$f":"IF(S1164<='Collection System Summary_Table'!$I$8,\"Yes\",\"NO\")","v":"Yes"}]
[null,null,null,null,null,null,null,null,null,null,null,null,0,{"$error":"#VALUE!"},{"$error":"#VALUE!"},0,{"$error":"#VALUE!"},{"$error":"#VALUE!"},0,{"$error":"#VALUE!"},{"$f":"IF(S1165<='Collection System Summary_Table'!$I$8,\"Yes\",\"NO\")","v":"Yes"}]
[null,null,null,null,null,null,null,null,null,null,null,null,0,{"$error":"#VALUE!"},{"$error":"#VALUE!"},0,{"$error":"#VALUE!"},{"$error":"#VALUE!"},0,{"$error":"#VALUE!"},{"$f":"IF(S1166<='Collection System Summary_Table'!$I$8,\"Yes\",\"NO\")","v":"Yes"}]
[null,null,null,null,null,null,null,null,null,null,null,null,0,{"$error":"#VALUE!"},{"$error":"#VALUE!"},0,{"$error":"#VALUE!"},{"$error":"#VALUE!"},0,{"$error":"#VALUE!"},{"$f":"IF(S1167<='Collection System Summary_Table'!$I$8,\"Yes\",\"NO\")","v":"Yes"}]
[null,null,null,null,null,null,null,null,null,null,null,null,0,{"$error":"#VALUE!"},{"$error":"#VALUE!"},0,{"$error":"#VALUE!"},{"$error":"#VALUE!"},0,{"$error":"#VALUE!"},{"$f":"IF(S1168<='Collection System Summary_Table'!$I$8,\"Yes\",\"NO\")","v":"Yes"}]
[null,null,null,null,null,null,null,null,null,null,null,null,0,{"$error":"#VALUE!"},{"$error":"#VALUE!"},0,{"$error":"#VALUE!"},{"$error":"#VALUE!"},0,{"$error":"#VALUE!"},{"$f":"IF(S1169<='Collection System Summary_Table'!$I$8,\"Yes\",\"NO\")","v":"Yes"}]
[null,null,null,null,null,null,null,null,null,null,null,null,0,{"$error":"#VALUE!"},{"$error":"#VALUE!"},0,{"$error":"#VALUE!"},{"$error":"#VALUE!"},0,{"$error":"#VALUE!"},{"$f":"IF(S1170<='Collection System Summary_Table'!$I$8,\"Yes\",\"NO\")","v":"Yes"}]
[null,null,null,null,null,null,null,null,null,null,null,null,0,{"$error":"#VALUE!"},{"$error":"#VALUE!"},0,{"$error":"#VALUE!"},{"$error":"#VALUE!"},0,{"$error":"#VALUE!"},{"$f":"IF(S1171<='Collection System Summary_Table'!$I$8,\"Yes\",\"NO\")","v":"Yes"}]
[null,null,null,null,null,null,null,null,null,null,null,null,0,{"$error":"#VALUE!"},{"$error":"#VALUE!"},0,{"$error":"#VALUE!"},{"$error":"#VALUE!"},0,{"$error":"#VALUE!"},{"$f":"IF(S1172<='Collection System Summary_Table'!$I$8,\"Yes\",\"NO\")","v":"Yes"}]
[null,null,null,null,null,null,null,null,null,null,null,null,0,{"$error":"#VALUE!"},{"$error":"#VALUE!"},0,{"$error":"#VALUE!"},{"$error":"#VALUE!"},0,{"$error":"#VALUE!"},{"$f":"IF(S1173<='Collection System Summary_Table'!$I$8,\"Yes\",\"NO\")","v":"Yes"}]
[null,null,null,null,null,null,null,null,null,null,null,null,0,{"$error":"#VALUE!"},{"$error":"#VALUE!"},0,{"$error":"#VALUE!"},{"$error":"#VALUE!"},0,{"$error":"#VALUE!"},{"$f":"IF(S1174<='Collection System Summary_Table'!$I$8,\"Yes\",\"NO\")","v":"Yes"}]
[null,null,null,null,null,null,null,null,null,null,null,null,0,{"$error":"#VALUE!"},{"$error":"#VALUE!"},0,{"$error":"#VALUE!"},{"$error":"#VALUE!"},0,{"$error":"#VALUE!"},{"$f":"IF(S1175<='Collection System Summary_Table'!$I$8,\"Yes\",\"NO\")","v":"Yes"}]
[null,null,null,null,null,null,null,null,null,null,null,null,0,{"$error":"#VALUE!"},{"$error":"#VALUE!"},0,{"$error":"#VALUE!"},{"$error":"#VALUE!"},0,{"$error":"#VALUE!"},{"$f":"IF(S1176<='Collection System Summary_Table'!$I$8,\"Yes\",\"NO\")","v":"Yes"}]
[null,null,null,null,null,null,null,null,null,null,null,null,0,{"$error":"#VALUE!"},{"$error":"#VALUE!"},0,{"$error":"#VALUE!"},{"$error":"#VALUE!"},0,{"$error":"#VALUE!"},{"$f":"IF(S1177<='Collection System Summary_Table'!$I$8,\"Yes\",\"NO\")","v":"Yes"}]
[null,null,null,null,null,null,null,null,null,null,null,null,0,{"$error":"#VALUE!"},{"$error":"#VALUE!"},0,{"$error":"#VALUE!"},{"$error":"#VALUE!"},0,{"$error":"#VALUE!"},{"$f":"IF(S1178<='Collection System Summary_Table'!$I$8,\"Yes\",\"NO\")","v":"Yes"}]
[null,null,null,null,null,null,null,null,null,null,null,null,0,{"$error":"#VALUE!"},{"$error":"#VALUE!"},0,{"$error":"#VALUE!"},{"$error":"#VALUE!"},0,{"$error":"#VALUE!"},{"$f":"IF(S1179<='Collection System Summary_Table'!$I$8,\"Yes\",\"NO\")","v":"Yes"}]
[null,null,null,null,null,null,null,null,null,null,null,null,0,{"$error":"#VALUE!"},{"$error":"#VALUE!"},0,{"$error":"#VALUE!"},{"$error":"#VALUE!"},0,{"$error":"#VALUE!"},{"$f":"IF(S1180<='Collection System Summary_Table'!$I$8,\"Yes\",\"NO\")","v":"Yes"}]
[null,null,null,null,null,null,null,null,null,null,null,null,0,{"$error":"#VALUE!"},{"$error":"#VALUE!"},0,{"$error":"#VALUE!"},{"$error":"#VALUE!"},0,{"$error":"#VALUE!"},{"$f":"IF(S1181<='Collection System Summary_Table'!$I$8,\"Yes\",\"NO\")","v":"Yes"}]
[null,null,null,null,null,null,null,null,null,null,null,null,0,{"$error":"#VALUE!"},{"$error":"#VALUE!"},0,{"$error":"#VALUE!"},{"$error":"#VALUE!"},0,{"$error":"#VALUE!"},{"$f":"IF(S1182<='Collection System Summary_Table'!$I$8,\"Yes\",\"NO\")","v":"Yes"}]
[null,null,null,null,null,null,null,null,null,null,null,null,0,{"$error":"#VALUE!"},{"$error":"#VALUE!"},0,{"$error":"#VALUE!"},{"$error":"#VALUE!"},0,{"$error":"#VALUE!"},{"$f":"IF(S1183<='Collection System Summary_Table'!$I$8,\"Yes\",\"NO\")","v":"Yes"}]
[null,null,null,null,null,null,null,null,null,null,null,null,0,{"$error":"#VALUE!"},{"$error":"#VALUE!"},0,{"$error":"#VALUE!"},{"$error":"#VALUE!"},0,{"$error":"#VALUE!"},{"$f":"IF(S1184<='Collection System Summary_Table'!$I$8,\"Yes\",\"NO\")","v":"Yes"}]
[null,null,null,null,null,null,null,null,null,null,null,null,0,{"$error":"#VALUE!"},{"$error":"#VALUE!"},0,{"$error":"#VALUE!"},{"$error":"#VALUE!"},0,{"$error":"#VALUE!"},{"$f":"IF(S1185<='Collection System Summary_Table'!$I$8,\"Yes\",\"NO\")","v":"Yes"}]
[null,null,null,null,null,null,null,null,null,null,null,null,0,{"$error":"#VALUE!"},{"$error":"#VALUE!"},0,{"$error":"#VALUE!"},{"$error":"#VALUE!"},0,{"$error":"#VALUE!"},{"$f":"IF(S1186<='Collection System Summary_Table'!$I$8,\"Yes\",\"NO\")","v":"Yes"}]
[null,null,null,null,null,null,null,null,null,null,null,null,0,{"$error":"#VALUE!"},{"$error":"#VALUE!"},0,{"$error":"#VALUE!"},{"$error":"#VALUE!"},0,{"$error":"#VALUE!"},{"$f":"IF(S1187<='Collection System Summary_Table'!$I$8,\"Yes\",\"NO\")","v":"Yes"}]
[null,null,null,null,null,null,null,null,null,null,null,null,0,{"$error":"#VALUE!"},{"$error":"#VALUE!"},0,{"$error":"#VALUE!"},{"$error":"#VALUE!"},0,{"$error":"#VALUE!"},{"$f":"IF(S1188<='Collection System Summary_Table'!$I$8,\"Yes\",\"NO\")","v":"Yes"}]
[null,null,null,null,null,null,null,null,null,null,null,null,0,{"$error":"#VALUE!"},{"$error":"#VALUE!"},0,{"$error":"#VALUE!"},{"$error":"#VALUE!"},0,{"$error":"#VALUE!"},{"$f":"IF(S1189<='Collection System Summary_Table'!$I$8,\"Yes\",\"NO\")","v":"Yes"}]
[null,null,null,null,null,null,null,null,null,null,null,null,0,{"$error":"#VALUE!"},{"$error":"#VALUE!"},0,{"$error":"#VALUE!"},{"$error":"#VALUE!"},0,{"$error":"#VALUE!"},{"$f":"IF(S1190<='Collection System Summary_Table'!$I$8,\"Yes\",\"NO\")","v":"Yes"}]
[null,null,null,null,null,null,null,null,null,null,null,null,0,{"$error":"#VALUE!"},{"$error":"#VALUE!"},0,{"$error":"#VALUE!"},{"$error":"#VALUE!"},0,{"$error":"#VALUE!"},{"$f":"IF(S1191<='Collection System Summary_Table'!$I$8,\"Yes\",\"NO\")","v":"Yes"}]
[null,null,null,null,null,null,null,null,null,null,null,null,0,{"$error":"#VALUE!"},{"$error":"#VALUE!"},0,{"$error":"#VALUE!"},{"$error":"#VALUE!"},0,{"$error":"#VALUE!"},{"$f":"IF(S1192<='Collection System Summary_Table'!$I$8,\"Yes\",\"NO\")","v":"Yes"}]
[null,null,null,null,null,null,null,null,null,null,null,null,0,{"$error":"#VALUE!"},{"$error":"#VALUE!"},0,{"$error":"#VALUE!"},{"$error":"#VALUE!"},0,{"$error":"#VALUE!"},{"$f":"IF(S1193<='Collection System Summary_Table'!$I$8,\"Yes\",\"NO\")","v":"Yes"}]
[null,null,null,null,null,null,null,null,null,null,null,null,0,{"$error":"#VALUE!"},{"$error":"#VALUE!"},0,{"$error":"#VALUE!"},{"$error":"#VALUE!"},0,{"$error":"#VALUE!"},{"$f":"IF(S1194<='Collection System Summary_Table'!$I$8,\"Yes\",\"NO\")","v":"Yes"}]
[null,null,null,null,null,null,null,null,null,null,null,null,0,{"$error":"#VALUE!"},{"$error":"#VALUE!"},0,{"$error":"#VALUE!"},{"$error":"#VALUE!"},0,{"$error":"#VALUE!"},{"$f":"IF(S1195<='Collection System Summary_Table'!$I$8,\"Yes\",\"NO\")","v":"Yes"}]
[null,null,null,null,null,null,null,null,null,null,null,null,0,{"$error":"#VALUE!"},{"$error":"#VALUE!"},0,{"$error":"#VALUE!"},{"$error":"#VALUE!"},0,{"$error":"#VALUE!"},{"$f":"IF(S1196<='Collection System Summary_Table'!$I$8,\"Yes\",\"NO\")","v":"Yes"}]
[null,null,null,null,null,null,null,null,null,null,null,null,0,{"$error":"#VALUE!"},{"$error":"#VALUE!"},0,{"$error":"#VALUE!"},{"$error":"#VALUE!"},0,{"$error":"#VALUE!"},{"$f":"IF(S1197<='Collection System Summary_Table'!$I$8,\"Yes\",\"NO\")","v":"Yes"}]
[null,null,null,null,null,null,null,null,null,null,null,null,0,{"$error":"#VALUE!"},{"$error":"#VALUE!"},0,{"$error":"#VALUE!"},{"$error":"#VALUE!"},0,{"$error":"#VALUE!"},{"$f":"IF(S1198<='Collection System Summary_Table'!$I$8,\"Yes\",\"NO\")","v":"Yes"}]
[null,null,null,null,null,null,null,null,null,null,null,null,0,{"$error":"#VALUE!"},{"$error":"#VALUE!"},0,{"$error":"#VALUE!"},{"$error":"#VALUE!"},0,{"$error":"#VALUE!"},{"$f":"IF(S1199<='Collection System Summary_Table'!$I$8,\"Yes\",\"NO\")","v":"Yes"}]
[null,null,null,null,null,null,null,null,null,null,null,null,0,{"$error":"#VALUE!"},{"$error":"#VALUE!"},0,{"$error":"#VALUE!"},{"$error":"#VALUE!"},0,{"$error":"#VALUE!"},{"$f":"IF(S1200<='Collection System Summary_Table'!$I$8,\"Yes\",\"NO\")","v":"Yes"}]
[null,null,null,null,null,null,null,null,null,null,null,null,0,{"$error":"#VALUE!"},{"$error":"#VALUE!"},0,{"$error":"#VALUE!"},{"$error":"#VALUE!"},0,{"$error":"#VALUE!"},{"$f":"IF(S1201<='Collection System Summary_Table'!$I$8,\"Yes\",\"NO\")","v":"Yes"}]
[null,null,null,null,null,null,null,null,null,null,null,null,0,{"$error":"#VALUE!"},{"$error":"#VALUE!"},0,{"$error":"#VALUE!"},{"$error":"#VALUE!"},0,{"$error":"#VALUE!"},{"$f":"IF(S1202<='Collection System Summary_Table'!$I$8,\"Yes\",\"NO\")","v":"Yes"}]
[null,null,null,null,null,null,null,null,null,null,null,null,0,{"$error":"#VALUE!"},{"$error":"#VALUE!"},0,{"$error":"#VALUE!"},{"$error":"#VALUE!"},0,{"$error":"#VALUE!"},{"$f":"IF(S1203<='Collection System Summary_Table'!$I$8,\"Yes\",\"NO\")","v":"Yes"}]
[null,null,null,null,null,null,null,null,null,null,null,null,0,{"$error":"#VALUE!"},{"$error":"#VALUE!"},0,{"$error":"#VALUE!"},{"$error":"#VALUE!"},0,{"$error":"#VALUE!"},{"$f":"IF(S1204<='Collection System Summary_Table'!$I$8,\"Yes\",\"NO\")","v":"Yes"}]
[null,null,null,null,null,null,null,null,null,null,null,null,0,{"$error":"#VALUE!"},{"$error":"#VALUE!"},0,{"$error":"#VALUE!"},{"$error":"#VALUE!"},0,{"$error":"#VALUE!"},{"$f":"IF(S1205<='Collection System Summary_Table'!$I$8,\"Yes\",\"NO\")","v":"Yes"}]
[null,null,null,null,null,null,null,null,null,null,null,null,0,{"$error":"#VALUE!"},{"$error":"#VALUE!"},0,{"$error":"#VALUE!"},{"$error":"#VALUE!"},0,{"$error":"#VALUE!"},{"$f":"IF(S1206<='Collection System Summary_Table'!$I$8,\"Yes\",\"NO\")","v":"Yes"}]
[null,null,null,null,null,null,null,null,null,null,null,null,0,{"$error":"#VALUE!"},{"$error":"#VALUE!"},0,{"$error":"#VALUE!"},{"$error":"#VALUE!"},0,{"$error":"#VALUE!"},{"$f":"IF(S1207<='Collection System Summary_Table'!$I$8,\"Yes\",\"NO\")","v":"Yes"}]
[null,null,null,null,null,null,null,null,null,null,null,null,0,{"$error":"#VALUE!"},{"$error":"#VALUE!"},0,{"$error":"#VALUE!"},{"$error":"#VALUE!"},0,{"$error":"#VALUE!"},{"$f":"IF(S1208<='Collection System Summary_Table'!$I$8,\"Yes\",\"NO\")","v":"Yes"}]
[null,null,null,null,null,null,null,null,null,null,null,null,0,{"$error":"#VALUE!"},{"$error":"#VALUE!"},0,{"$error":"#VALUE!"},{"$error":"#VALUE!"},0,{"$error":"#VALUE!"},{"$f":"IF(S1209<='Collection System Summary_Table'!$I$8,\"Yes\",\"NO\")","v":"Yes"}]
[null,null,null,null,null,null,null,null,null,null,null,null,0,{"$error":"#VALUE!"},{"$error":"#VALUE!"},0,{"$error":"#VALUE!"},{"$error":"#VALUE!"},0,{"$error":"#VALUE!"},{"$f":"IF(S1210<='Collection System Summary_Table'!$I$8,\"Yes\",\"NO\")","v":"Yes"}]
[null,null,null,null,null,null,null,null,null,null,null,null,0,{"$error":"#VALUE!"},{"$error":"#VALUE!"},0,{"$error":"#VALUE!"},{"$error":"#VALUE!"},0,{"$error":"#VALUE!"},{"$f":"IF(S1211<='Collection System Summary_Table'!$I$8,\"Yes\",\"NO\")","v":"Yes"}]
[null,null,null,null,null,null,null,null,null,null,null,null,0,{"$error":"#VALUE!"},{"$error":"#VALUE!"},0,{"$error":"#VALUE!"},{"$error":"#VALUE!"},0,{"$error":"#VALUE!"},{"$f":"IF(S1212<='Collection System Summary_Table'!$I$8,\"Yes\",\"NO\")","v":"Yes"}]
[null,null,null,null,null,null,null,null,null,null,null,null,0,{"$error":"#VALUE!"},{"$error":"#VALUE!"},0,{"$error":"#VALUE!"},{"$error":"#VALUE!"},0,{"$error":"#VALUE!"},{"$f":"IF(S1213<='Collection System Summary_Table'!$I$8,\"Yes\",\"NO\")","v":"Yes"}]
[null,null,null,null,null,null,null,null,null,null,null,null,0,{"$error":"#VALUE!"},{"$error":"#VALUE!"},0,{"$error":"#VALUE!"},{"$error":"#VALUE!"},0,{"$error":"#VALUE!"},{"$f":"IF(S1214<='Collection System Summary_Table'!$I$8,\"Yes\",\"NO\")","v":"Yes"}]
[null,null,null,null,null,null,null,null,null,null,null,null,0,{"$error":"#VALUE!"},{"$error":"#VALUE!"},0,{"$error":"#VALUE!"},{"$error":"#VALUE!"},0,{"$error":"#VALUE!"},{"$f":"IF(S1215<='Collection System Summary_Table'!$I$8,\"Yes\",\"NO\")","v":"Yes"}]
[null,null,null,null,null,null,null,null,null,null,null,null,0,{"$error":"#VALUE!"},{"$error":"#VALUE!"},0,{"$error":"#VALUE!"},{"$error":"#VALUE!"},0,{"$error":"#VALUE!"},{"$f":"IF(S1216<='Collection System Summary_Table'!$I$8,\"Yes\",\"NO\")","v":"Yes"}]
[null,null,null,null,null,null,null,null,null,null,null,null,0,{"$error":"#VALUE!"},{"$error":"#VALUE!"},0,{"$error":"#VALUE!"},{"$error":"#VALUE!"},0,{"$error":"#VALUE!"},{"$f":"IF(S1217<='Collection System Summary_Table'!$I$8,\"Yes\",\"NO\")","v":"Yes"}]
[null,null,null,null,null,null,null,null,null,null,null,null,0,{"$error":"#VALUE!"},{"$error":"#VALUE!"},0,{"$error":"#VALUE!"},{"$error":"#VALUE!"},0,{"$error":"#VALUE!"},{"$f":"IF(S1218<='Collection System Summary_Table'!$I$8,\"Yes\",\"NO\")","v":"Yes"}]
[null,null,null,null,null,null,null,null,null,null,null,null,0,{"$f":"IF(P1219=0,I1219+N1218,0)","v":{"$error":"#VALUE!"}},{"$error":"#VALUE!"},0,{"$error":"#VALUE!"},{"$error":"#VALUE!"},0,{"$error":"#VALUE!"},{"$f":"IF(S1219<='Collection System Summary_Table'!$I$8,\"Yes\",\"NO\")","v":"Yes"}]
[null,null,null,null,null,null,null,null,null,null,null,null,0,{"$error":"#VALUE!"},{"$f":"IF(AND(Q1220=0,P1220=0),K1220+O1219,0)","v":{"$error":"#VALUE!"}},0,{"$f":"IF(AND(P1220=0,N1220<($B$4+$P$1)),J1220,0)","v":{"$error":"#VALUE!"}},{"$f":"IF(AND(P1220=0,Q1220=0,O1220<($B$5+$Q$1)),K1220,0)","v":{"$error":"#VALUE!"}},{"$f":"S1219+L1220","v":0},{"$f":"IF(OR(P1220>1,Q1220>1,R1220>1),\"YES\",\"NO\")","v":{"$error":"#VALUE!"}},{"$f":"IF(S1220<='Collection System Summary_Table'!$I$8,\"Yes\",\"NO\")","v":"Yes"}]
[null,null,null,null,null,null,null,null,null,null,null,null,{"$f":"M1220+I1221","v":0},{"$error":"#VALUE!"},{"$error":"#VALUE!"},{"$f":"IF(M1221<=$B$3,I1221,0)","v":0},{"$error":"#VALUE!"},{"$error":"#VALUE!"},0,{"$error":"#VALUE!"},{"$f":"IF(S1221<='Collection System Summary_Table'!$I$8,\"Yes\",\"NO\")","v":"Yes"}]
[null,null,null,null,null,null,null,null,null,null,null,null,0,{"$error":"#VALUE!"},{"$error":"#VALUE!"},0,{"$error":"#VALUE!"},{"$error":"#VALUE!"},0,{"$error":"#VALUE!"},{"$f":"IF(S1222<='Collection System Summary_Table'!$I$8,\"Yes\",\"NO\")","v":"Yes"}]
[null,null,null,null,null,null,null,null,null,null,null,null,0,{"$error":"#VALUE!"},{"$error":"#VALUE!"},0,{"$error":"#VALUE!"},{"$error":"#VALUE!"},0,{"$error":"#VALUE!"},{"$f":"IF(S1223<='Collection System Summary_Table'!$I$8,\"Yes\",\"NO\")","v":"Yes"}]
[null,null,null,null,null,null,null,null,null,null,null,null,0,{"$error":"#VALUE!"},{"$error":"#VALUE!"},0,{"$error":"#VALUE!"},{"$error":"#VALUE!"},0,{"$error":"#VALUE!"},{"$f":"IF(S1224<='Collection System Summary_Table'!$I$8,\"Yes\",\"NO\")","v":"Yes"}]
[null,null,null,null,null,null,null,null,null,null,null,null,0,{"$error":"#VALUE!"},{"$error":"#VALUE!"},0,{"$error":"#VALUE!"},{"$error":"#VALUE!"},0,{"$error":"#VALUE!"},{"$f":"IF(S1225<='Collection System Summary_Table'!$I$8,\"Yes\",\"NO\")","v":"Yes"}]
[null,null,null,null,null,null,null,null,null,null,null,null,0,{"$error":"#VALUE!"},{"$error":"#VALUE!"},0,{"$error":"#VALUE!"},{"$error":"#VALUE!"},0,{"$error":"#VALUE!"},{"$f":"IF(S1226<='Collection System Summary_Table'!$I$8,\"Yes\",\"NO\")","v":"Yes"}]
[null,null,null,null,null,null,null,null,null,null,null,null,0,{"$error":"#VALUE!"},{"$error":"#VALUE!"},0,{"$error":"#VALUE!"},{"$error":"#VALUE!"},0,{"$error":"#VALUE!"},{"$f":"IF(S1227<='Collection System Summary_Table'!$I$8,\"Yes\",\"NO\")","v":"Yes"}]
[null,null,null,null,null,null,null,null,null,null,null,null,0,{"$error":"#VALUE!"},{"$error":"#VALUE!"},0,{"$error":"#VALUE!"},{"$error":"#VALUE!"},0,{"$error":"#VALUE!"},{"$f":"IF(S1228<='Collection System Summary_Table'!$I$8,\"Yes\",\"NO\")","v":"Yes"}]
[null,null,null,null,null,null,null,null,null,null,null,null,0,{"$error":"#VALUE!"},{"$error":"#VALUE!"},0,{"$error":"#VALUE!"},{"$error":"#VALUE!"},0,{"$error":"#VALUE!"},{"$f":"IF(S1229<='Collection System Summary_Table'!$I$8,\"Yes\",\"NO\")","v":"Yes"}]
[null,null,null,null,null,null,null,null,null,null,null,null,0,{"$error":"#VALUE!"},{"$error":"#VALUE!"},0,{"$error":"#VALUE!"},{"$error":"#VALUE!"},0,{"$error":"#VALUE!"},{"$f":"IF(S1230<='Collection System Summary_Table'!$I$8,\"Yes\",\"NO\")","v":"Yes"}]
[null,null,null,null,null,null,null,null,null,null,null,null,0,{"$error":"#VALUE!"},{"$error":"#VALUE!"},0,{"$error":"#VALUE!"},{"$error":"#VALUE!"},0,{"$error":"#VALUE!"},{"$f":"IF(S1231<='Collection System Summary_Table'!$I$8,\"Yes\",\"NO\")","v":"Yes"}]
[null,null,null,null,null,null,null,null,null,null,null,null,0,{"$error":"#VALUE!"},{"$error":"#VALUE!"},0,{"$error":"#VALUE!"},{"$error":"#VALUE!"},0,{"$error":"#VALUE!"},{"$f":"IF(S1232<='Collection System Summary_Table'!$I$8,\"Yes\",\"NO\")","v":"Yes"}]
[null,null,null,null,null,null,null,null,null,null,null,null,0,{"$error":"#VALUE!"},{"$error":"#VALUE!"},0,{"$error":"#VALUE!"},{"$error":"#VALUE!"},0,{"$error":"#VALUE!"},{"$f":"IF(S1233<='Collection System Summary_Table'!$I$8,\"Yes\",\"NO\")","v":"Yes"}]
[null,null,null,null,null,null,null,null,null,null,null,null,0,{"$error":"#VALUE!"},{"$error":"#VALUE!"},0,{"$error":"#VALUE!"},{"$error":"#VALUE!"},0,{"$error":"#VALUE!"},{"$f":"IF(S1234<='Collection System Summary_Table'!$I$8,\"Yes\",\"NO\")","v":"Yes"}]
[null,null,null,null,null,null,null,null,null,null,null,null,0,{"$error":"#VALUE!"},{"$error":"#VALUE!"},0,{"$error":"#VALUE!"},{"$error":"#VALUE!"},0,{"$error":"#VALUE!"},{"$f":"IF(S1235<='Collection System Summary_Table'!$I$8,\"Yes\",\"NO\")","v":"Yes"}]
[null,null,null,null,null,null,null,null,null,null,null,null,0,{"$error":"#VALUE!"},{"$error":"#VALUE!"},0,{"$error":"#VALUE!"},{"$error":"#VALUE!"},0,{"$error":"#VALUE!"},{"$f":"IF(S1236<='Collection System Summary_Table'!$I$8,\"Yes\",\"NO\")","v":"Yes"}]
[null,null,null,null,null,null,null,null,null,null,null,null,0,{"$error":"#VALUE!"},{"$error":"#VALUE!"},0,{"$error":"#VALUE!"},{"$error":"#VALUE!"},0,{"$error":"#VALUE!"},{"$f":"IF(S1237<='Collection System Summary_Table'!$I$8,\"Yes\",\"NO\")","v":"Yes"}]
[null,null,null,null,null,null,null,null,null,null,null,null,0,{"$error":"#VALUE!"},{"$error":"#VALUE!"},0,{"$error":"#VALUE!"},{"$error":"#VALUE!"},0,{"$error":"#VALUE!"},{"$f":"IF(S1238<='Collection System Summary_Table'!$I$8,\"Yes\",\"NO\")","v":"Yes"}]
[null,null,null,null,null,null,null,null,null,null,null,null,0,{"$error":"#VALUE!"},{"$error":"#VALUE!"},0,{"$error":"#VALUE!"},{"$error":"#VALUE!"},0,{"$error":"#VALUE!"},{"$f":"IF(S1239<='Collection System Summary_Table'!$I$8,\"Yes\",\"NO\")","v":"Yes"}]
[null,null,null,null,null,null,null,null,null,null,null,null,0,{"$error":"#VALUE!"},{"$error":"#VALUE!"},0,{"$error":"#VALUE!"},{"$error":"#VALUE!"},0,{"$error":"#VALUE!"},{"$f":"IF(S1240<='Collection System Summary_Table'!$I$8,\"Yes\",\"NO\")","v":"Yes"}]
[null,null,null,null,null,null,null,null,null,null,null,null,0,{"$error":"#VALUE!"},{"$error":"#VALUE!"},0,{"$error":"#VALUE!"},{"$error":"#VALUE!"},0,{"$error":"#VALUE!"},{"$f":"IF(S1241<='Collection System Summary_Table'!$I$8,\"Yes\",\"NO\")","v":"Yes"}]
[null,null,null,null,null,null,null,null,null,null,null,null,0,{"$error":"#VALUE!"},{"$error":"#VALUE!"},0,{"$error":"#VALUE!"},{"$error":"#VALUE!"},0,{"$error":"#VALUE!"},{"$f":"IF(S1242<='Collection System Summary_Table'!$I$8,\"Yes\",\"NO\")","v":"Yes"}]
[null,null,null,null,null,null,null,null,null,null,null,null,0,{"$error":"#VALUE!"},{"$error":"#VALUE!"},0,{"$error":"#VALUE!"},{"$error":"#VALUE!"},0,{"$error":"#VALUE!"},{"$f":"IF(S1243<='Collection System Summary_Table'!$I$8,\"Yes\",\"NO\")","v":"Yes"}]
[null,null,null,null,null,null,null,null,null,null,null,null,0,{"$error":"#VALUE!"},{"$error":"#VALUE!"},0,{"$error":"#VALUE!"},{"$error":"#VALUE!"},0,{"$error":"#VALUE!"},{"$f":"IF(S1244<='Collection System Summary_Table'!$I$8,\"Yes\",\"NO\")","v":"Yes"}]
[null,null,null,null,null,null,null,null,null,null,null,null,0,{"$error":"#VALUE!"},{"$error":"#VALUE!"},0,{"$error":"#VALUE!"},{"$error":"#VALUE!"},0,{"$error":"#VALUE!"},{"$f":"IF(S1245<='Collection System Summary_Table'!$I$8,\"Yes\",\"NO\")","v":"Yes"}]
[null,null,null,null,null,null,null,null,null,null,null,null,0,{"$error":"#VALUE!"},{"$error":"#VALUE!"},0,{"$error":"#VALUE!"},{"$error":"#VALUE!"},0,{"$error":"#VALUE!"},{"$f":"IF(S1246<='Collection System Summary_Table'!$I$8,\"Yes\",\"NO\")","v":"Yes"}]
[null,null,null,null,null,null,null,null,null,null,null,null,0,{"$error":"#VALUE!"},{"$error":"#VALUE!"},0,{"$error":"#VALUE!"},{"$error":"#VALUE!"},0,{"$error":"#VALUE!"},{"$f":"IF(S1247<='Collection System Summary_Table'!$I$8,\"Yes\",\"NO\")","v":"Yes"}]
[null,null,null,null,null,null,null,null,null,null,null,null,0,{"$error":"#VALUE!"},{"$error":"#VALUE!"},0,{"$error":"#VALUE!"},{"$error":"#VALUE!"},0,{"$error":"#VALUE!"},{"$f":"IF(S1248<='Collection System Summary_Table'!$I$8,\"Yes\",\"NO\")","v":"Yes"}]
[null,null,null,null,null,null,null,null,null,null,null,null,0,{"$error":"#VALUE!"},{"$error":"#VALUE!"},0,{"$error":"#VALUE!"},{"$error":"#VALUE!"},0,{"$error":"#VALUE!"},{"$f":"IF(S1249<='Collection System Summary_Table'!$I$8,\"Yes\",\"NO\")","v":"Yes"}]
[null,null,null,null,null,null,null,null,null,null,null,null,0,{"$error":"#VALUE!"},{"$error":"#VALUE!"},0,{"$error":"#VALUE!"},{"$error":"#VALUE!"},0,{"$error":"#VALUE!"},{"$f":"IF(S1250<='Collection System Summary_Table'!$I$8,\"Yes\",\"NO\")","v":"Yes"}]
[null,null,null,null,null,null,null,null,null,null,null,null,0,{"$error":"#VALUE!"},{"$error":"#VALUE!"},0,{"$error":"#VALUE!"},{"$error":"#VALUE!"},0,{"$error":"#VALUE!"},{"$f":"IF(S1251<='Collection System Summary_Table'!$I$8,\"Yes\",\"NO\")","v":"Yes"}]
[null,null,null,null,null,null,null,null,null,null,null,null,0,{"$error":"#VALUE!"},{"$error":"#VALUE!"},0,{"$error":"#VALUE!"},{"$error":"#VALUE!"},0,{"$error":"#VALUE!"},{"$f":"IF(S1252<='Collection System Summary_Table'!$I$8,\"Yes\",\"NO\")","v":"Yes"}]
[null,null,null,null,null,null,null,null,null,null,null,null,0,{"$error":"#VALUE!"},{"$error":"#VALUE!"},0,{"$error":"#VALUE!"},{"$error":"#VALUE!"},0,{"$error":"#VALUE!"},{"$f":"IF(S1253<='Collection System Summary_Table'!$I$8,\"Yes\",\"NO\")","v":"Yes"}]
[null,null,null,null,null,null,null,null,null,null,null,null,0,{"$error":"#VALUE!"},{"$error":"#VALUE!"},0,{"$error":"#VALUE!"},{"$error":"#VALUE!"},0,{"$error":"#VALUE!"},{"$f":"IF(S1254<='Collection System Summary_Table'!$I$8,\"Yes\",\"NO\")","v":"Yes"}]
[null,null,null,null,null,null,null,null,null,null,null,null,0,{"$error":"#VALUE!"},{"$error":"#VALUE!"},0,{"$error":"#VALUE!"},{"$error":"#VALUE!"},0,{"$error":"#VALUE!"},{"$f":"IF(S1255<='Collection System Summary_Table'!$I$8,\"Yes\",\"NO\")","v":"Yes"}]
[null,null,null,null,null,null,null,null,null,null,null,null,0,{"$error":"#VALUE!"},{"$error":"#VALUE!"},0,{"$error":"#VALUE!"},{"$error":"#VALUE!"},0,{"$error":"#VALUE!"},{"$f":"IF(S1256<='Collection System Summary_Table'!$I$8,\"Yes\",\"NO\")","v":"Yes"}]
[null,null,null,null,null,null,null,null,null,null,null,null,0,{"$error":"#VALUE!"},{"$error":"#VALUE!"},0,{"$error":"#VALUE!"},{"$error":"#VALUE!"},0,{"$error":"#VALUE!"},{"$f":"IF(S1257<='Collection System Summary_Table'!$I$8,\"Yes\",\"NO\")","v":"Yes"}]
[null,null,null,null,null,null,null,null,null,null,null,null,0,{"$error":"#VALUE!"},{"$error":"#VALUE!"},0,{"$error":"#VALUE!"},{"$error":"#VALUE!"},0,{"$error":"#VALUE!"},{"$f":"IF(S1258<='Collection System Summary_Table'!$I$8,\"Yes\",\"NO\")","v":"Yes"}]
[null,null,null,null,null,null,null,null,null,null,null,null,0,{"$error":"#VALUE!"},{"$error":"#VALUE!"},0,{"$error":"#VALUE!"},{"$error":"#VALUE!"},0,{"$error":"#VALUE!"},{"$f":"IF(S1259<='Collection System Summary_Table'!$I$8,\"Yes\",\"NO\")","v":"Yes"}]
[null,null,null,null,null,null,null,null,null,null,null,null,0,{"$error":"#VALUE!"},{"$error":"#VALUE!"},0,{"$error":"#VALUE!"},{"$error":"#VALUE!"},0,{"$error":"#VALUE!"},{"$f":"IF(S1260<='Collection System Summary_Table'!$I$8,\"Yes\",\"NO\")","v":"Yes"}]
[null,null,null,null,null,null,null,null,null,null,null,null,0,{"$error":"#VALUE!"},{"$error":"#VALUE!"},0,{"$error":"#VALUE!"},{"$error":"#VALUE!"},0,{"$error":"#VALUE!"},{"$f":"IF(S1261<='Collection System Summary_Table'!$I$8,\"Yes\",\"NO\")","v":"Yes"}]
[null,null,null,null,null,null,null,null,null,null,null,null,0,{"$error":"#VALUE!"},{"$error":"#VALUE!"},0,{"$error":"#VALUE!"},{"$error":"#VALUE!"},0,{"$error":"#VALUE!"},{"$f":"IF(S1262<='Collection System Summary_Table'!$I$8,\"Yes\",\"NO\")","v":"Yes"}]
[null,null,null,null,null,null,null,null,null,null,null,null,0,{"$error":"#VALUE!"},{"$error":"#VALUE!"},0,{"$error":"#VALUE!"},{"$error":"#VALUE!"},0,{"$error":"#VALUE!"},{"$f":"IF(S1263<='Collection System Summary_Table'!$I$8,\"Yes\",\"NO\")","v":"Yes"}]
[null,null,null,null,null,null,null,null,null,null,null,null,0,{"$error":"#VALUE!"},{"$error":"#VALUE!"},0,{"$error":"#VALUE!"},{"$error":"#VALUE!"},0,{"$error":"#VALUE!"},{"$f":"IF(S1264<='Collection System Summary_Table'!$I$8,\"Yes\",\"NO\")","v":"Yes"}]
[null,null,null,null,null,null,null,null,null,null,null,null,0,{"$error":"#VALUE!"},{"$error":"#VALUE!"},0,{"$error":"#VALUE!"},{"$error":"#VALUE!"},0,{"$error":"#VALUE!"},{"$f":"IF(S1265<='Collection System Summary_Table'!$I$8,\"Yes\",\"NO\")","v":"Yes"}]
[null,null,null,null,null,null,null,null,null,null,null,null,0,{"$error":"#VALUE!"},{"$error":"#VALUE!"},0,{"$error":"#VALUE!"},{"$error":"#VALUE!"},0,{"$error":"#VALUE!"},{"$f":"IF(S1266<='Collection System Summary_Table'!$I$8,\"Yes\",\"NO\")","v":"Yes"}]
[null,null,null,null,null,null,null,null,null,null,null,null,0,{"$error":"#VALUE!"},{"$error":"#VALUE!"},0,{"$error":"#VALUE!"},{"$error":"#VALUE!"},0,{"$error":"#VALUE!"},{"$f":"IF(S1267<='Collection System Summary_Table'!$I$8,\"Yes\",\"NO\")","v":"Yes"}]
[null,null,null,null,null,null,null,null,null,null,null,null,0,{"$error":"#VALUE!"},{"$error":"#VALUE!"},0,{"$error":"#VALUE!"},{"$error":"#VALUE!"},0,{"$error":"#VALUE!"},{"$f":"IF(S1268<='Collection System Summary_Table'!$I$8,\"Yes\",\"NO\")","v":"Yes"}]
[null,null,null,null,null,null,null,null,null,null,null,null,0,{"$error":"#VALUE!"},{"$error":"#VALUE!"},0,{"$error":"#VALUE!"},{"$error":"#VALUE!"},0,{"$error":"#VALUE!"},{"$f":"IF(S1269<='Collection System Summary_Table'!$I$8,\"Yes\",\"NO\")","v":"Yes"}]
[null,null,null,null,null,null,null,null,null,null,null,null,0,{"$error":"#VALUE!"},{"$error":"#VALUE!"},0,{"$error":"#VALUE!"},{"$error":"#VALUE!"},0,{"$error":"#VALUE!"},{"$f":"IF(S1270<='Collection System Summary_Table'!$I$8,\"Yes\",\"NO\")","v":"Yes"}]
[null,null,null,null,null,null,null,null,null,null,null,null,0,{"$error":"#VALUE!"},{"$error":"#VALUE!"},0,{"$error":"#VALUE!"},{"$error":"#VALUE!"},0,{"$error":"#VALUE!"},{"$f":"IF(S1271<='Collection System Summary_Table'!$I$8,\"Yes\",\"NO\")","v":"Yes"}]
[null,null,null,null,null,null,null,null,null,null,null,null,0,{"$error":"#VALUE!"},{"$error":"#VALUE!"},0,{"$error":"#VALUE!"},{"$error":"#VALUE!"},0,{"$error":"#VALUE!"},{"$f":"IF(S1272<='Collection System Summary_Table'!$I$8,\"Yes\",\"NO\")","v":"Yes"}]
[null,null,null,null,null,null,null,null,null,null,null,null,0,{"$error":"#VALUE!"},{"$error":"#VALUE!"},0,{"$error":"#VALUE!"},{"$error":"#VALUE!"},0,{"$error":"#VALUE!"},{"$f":"IF(S1273<='Collection System Summary_Table'!$I$8,\"Yes\",\"NO\")","v":"Yes"}]
[null,null,null,null,null,null,null,null,null,null,null,null,0,{"$error":"#VALUE!"},{"$error":"#VALUE!"},0,{"$error":"#VALUE!"},{"$error":"#VALUE!"},0,{"$error":"#VALUE!"},{"$f":"IF(S1274<='Collection System Summary_Table'!$I$8,\"Yes\",\"NO\")","v":"Yes"}]
[null,null,null,null,null,null,null,null,null,null,null,null,0,{"$error":"#VALUE!"},{"$error":"#VALUE!"},0,{"$error":"#VALUE!"},{"$error":"#VALUE!"},0,{"$error":"#VALUE!"},{"$f":"IF(S1275<='Collection System Summary_Table'!$I$8,\"Yes\",\"NO\")","v":"Yes"}]
[null,null,null,null,null,null,null,null,null,null,null,null,0,{"$error":"#VALUE!"},{"$error":"#VALUE!"},0,{"$error":"#VALUE!"},{"$error":"#VALUE!"},0,{"$error":"#VALUE!"},{"$f":"IF(S1276<='Collection System Summary_Table'!$I$8,\"Yes\",\"NO\")","v":"Yes"}]
[null,null,null,null,null,null,null,null,null,null,null,null,0,{"$error":"#VALUE!"},{"$error":"#VALUE!"},0,{"$error":"#VALUE!"},{"$error":"#VALUE!"},0,{"$error":"#VALUE!"},{"$f":"IF(S1277<='Collection System Summary_Table'!$I$8,\"Yes\",\"NO\")","v":"Yes"}]
[null,null,null,null,null,null,null,null,null,null,null,null,0,{"$error":"#VALUE!"},{"$error":"#VALUE!"},0,{"$error":"#VALUE!"},{"$error":"#VALUE!"},0,{"$error":"#VALUE!"},{"$f":"IF(S1278<='Collection System Summary_Table'!$I$8,\"Yes\",\"NO\")","v":"Yes"}]
[null,null,null,null,null,null,null,null,null,null,null,null,0,{"$error":"#VALUE!"},{"$error":"#VALUE!"},0,{"$error":"#VALUE!"},{"$error":"#VALUE!"},0,{"$error":"#VALUE!"},{"$f":"IF(S1279<='Collection System Summary_Table'!$I$8,\"Yes\",\"NO\")","v":"Yes"}]
[null,null,null,null,null,null,null,null,null,null,null,null,0,{"$error":"#VALUE!"},{"$error":"#VALUE!"},0,{"$error":"#VALUE!"},{"$error":"#VALUE!"},0,{"$error":"#VALUE!"},{"$f":"IF(S1280<='Collection System Summary_Table'!$I$8,\"Yes\",\"NO\")","v":"Yes"}]
[null,null,null,null,null,null,null,null,null,null,null,null,0,{"$error":"#VALUE!"},{"$error":"#VALUE!"},0,{"$error":"#VALUE!"},{"$error":"#VALUE!"},0,{"$error":"#VALUE!"},{"$f":"IF(S1281<='Collection System Summary_Table'!$I$8,\"Yes\",\"NO\")","v":"Yes"}]
[null,null,null,null,null,null,null,null,null,null,null,null,0,{"$error":"#VALUE!"},{"$error":"#VALUE!"},0,{"$error":"#VALUE!"},{"$error":"#VALUE!"},0,{"$error":"#VALUE!"},{"$f":"IF(S1282<='Collection System Summary_Table'!$I$8,\"Yes\",\"NO\")","v":"Yes"}]
[null,null,null,null,null,null,null,null,null,null,null,null,0,{"$f":"IF(P1283=0,I1283+N1282,0)","v":{"$error":"#VALUE!"}},{"$error":"#VALUE!"},0,{"$error":"#VALUE!"},{"$error":"#VALUE!"},0,{"$error":"#VALUE!"},{"$f":"IF(S1283<='Collection System Summary_Table'!$I$8,\"Yes\",\"NO\")","v":"Yes"}]
[null,null,null,null,null,null,null,null,null,null,null,null,0,{"$error":"#VALUE!"},{"$f":"IF(AND(Q1284=0,P1284=0),K1284+O1283,0)","v":{"$error":"#VALUE!"}},0,{"$f":"IF(AND(P1284=0,N1284<($B$4+$P$1)),J1284,0)","v":{"$error":"#VALUE!"}},{"$f":"IF(AND(P1284=0,Q1284=0,O1284<($B$5+$Q$1)),K1284,0)","v":{"$error":"#VALUE!"}},{"$f":"S1283+L1284","v":0},{"$f":"IF(OR(P1284>1,Q1284>1,R1284>1),\"YES\",\"NO\")","v":{"$error":"#VALUE!"}},{"$f":"IF(S1284<='Collection System Summary_Table'!$I$8,\"Yes\",\"NO\")","v":"Yes"}]
[null,null,null,null,null,null,null,null,null,null,null,null,{"$f":"M1284+I1285","v":0},{"$error":"#VALUE!"},{"$error":"#VALUE!"},{"$f":"IF(M1285<=$B$3,I1285,0)","v":0},{"$error":"#VALUE!"},{"$error":"#VALUE!"},0,{"$error":"#VALUE!"},{"$f":"IF(S1285<='Collection System Summary_Table'!$I$8,\"Yes\",\"NO\")","v":"Yes"}]
[null,null,null,null,null,null,null,null,null,null,null,null,0,{"$error":"#VALUE!"},{"$error":"#VALUE!"},0,{"$error":"#VALUE!"},{"$error":"#VALUE!"},0,{"$error":"#VALUE!"},{"$f":"IF(S1286<='Collection System Summary_Table'!$I$8,\"Yes\",\"NO\")","v":"Yes"}]
[null,null,null,null,null,null,null,null,null,null,null,null,0,{"$error":"#VALUE!"},{"$error":"#VALUE!"},0,{"$error":"#VALUE!"},{"$error":"#VALUE!"},0,{"$error":"#VALUE!"},{"$f":"IF(S1287<='Collection System Summary_Table'!$I$8,\"Yes\",\"NO\")","v":"Yes"}]
[null,null,null,null,null,null,null,null,null,null,null,null,0,{"$error":"#VALUE!"},{"$error":"#VALUE!"},0,{"$error":"#VALUE!"},{"$error":"#VALUE!"},0,{"$error":"#VALUE!"},{"$f":"IF(S1288<='Collection System Summary_Table'!$I$8,\"Yes\",\"NO\")","v":"Yes"}]
[null,null,null,null,null,null,null,null,null,null,null,null,0,{"$error":"#VALUE!"},{"$error":"#VALUE!"},0,{"$error":"#VALUE!"},{"$error":"#VALUE!"},0,{"$error":"#VALUE!"},{"$f":"IF(S1289<='Collection System Summary_Table'!$I$8,\"Yes\",\"NO\")","v":"Yes"}]
[null,null,null,null,null,null,null,null,null,null,null,null,0,{"$error":"#VALUE!"},{"$error":"#VALUE!"},0,{"$error":"#VALUE!"},{"$error":"#VALUE!"},0,{"$error":"#VALUE!"},{"$f":"IF(S1290<='Collection System Summary_Table'!$I$8,\"Yes\",\"NO\")","v":"Yes"}]
[null,null,null,null,null,null,null,null,null,null,null,null,0,{"$error":"#VALUE!"},{"$error":"#VALUE!"},0,{"$error":"#VALUE!"},{"$error":"#VALUE!"},0,{"$error":"#VALUE!"},{"$f":"IF(S1291<='Collection System Summary_Table'!$I$8,\"Yes\",\"NO\")","v":"Yes"}]
[null,null,null,null,null,null,null,null,null,null,null,null,0,{"$error":"#VALUE!"},{"$error":"#VALUE!"},0,{"$error":"#VALUE!"},{"$error":"#VALUE!"},0,{"$error":"#VALUE!"},{"$f":"IF(S1292<='Collection System Summary_Table'!$I$8,\"Yes\",\"NO\")","v":"Yes"}]
[null,null,null,null,null,null,null,null,null,null,null,null,0,{"$error":"#VALUE!"},{"$error":"#VALUE!"},0,{"$error":"#VALUE!"},{"$error":"#VALUE!"},0,{"$error":"#VALUE!"},{"$f":"IF(S1293<='Collection System Summary_Table'!$I$8,\"Yes\",\"NO\")","v":"Yes"}]
[null,null,null,null,null,null,null,null,null,null,null,null,0,{"$error":"#VALUE!"},{"$error":"#VALUE!"},0,{"$error":"#VALUE!"},{"$error":"#VALUE!"},0,{"$error":"#VALUE!"},{"$f":"IF(S1294<='Collection System Summary_Table'!$I$8,\"Yes\",\"NO\")","v":"Yes"}]
[null,null,null,null,null,null,null,null,null,null,null,null,0,{"$error":"#VALUE!"},{"$error":"#VALUE!"},0,{"$error":"#VALUE!"},{"$error":"#VALUE!"},0,{"$error":"#VALUE!"},{"$f":"IF(S1295<='Collection System Summary_Table'!$I$8,\"Yes\",\"NO\")","v":"Yes"}]
[null,null,null,null,null,null,null,null,null,null,null,null,0,{"$error":"#VALUE!"},{"$error":"#VALUE!"},0,{"$error":"#VALUE!"},{"$error":"#VALUE!"},0,{"$error":"#VALUE!"},{"$f":"IF(S1296<='Collection System Summary_Table'!$I$8,\"Yes\",\"NO\")","v":"Yes"}]
[null,null,null,null,null,null,null,null,null,null,null,null,0,{"$error":"#VALUE!"},{"$error":"#VALUE!"},0,{"$error":"#VALUE!"},{"$error":"#VALUE!"},0,{"$error":"#VALUE!"},{"$f":"IF(S1297<='Collection System Summary_Table'!$I$8,\"Yes\",\"NO\")","v":"Yes"}]
[null,null,null,null,null,null,null,null,null,null,null,null,0,{"$error":"#VALUE!"},{"$error":"#VALUE!"},0,{"$error":"#VALUE!"},{"$error":"#VALUE!"},0,{"$error":"#VALUE!"},{"$f":"IF(S1298<='Collection System Summary_Table'!$I$8,\"Yes\",\"NO\")","v":"Yes"}]
[null,null,null,null,null,null,null,null,null,null,null,null,0,{"$error":"#VALUE!"},{"$error":"#VALUE!"},0,{"$error":"#VALUE!"},{"$error":"#VALUE!"},0,{"$error":"#VALUE!"},{"$f":"IF(S1299<='Collection System Summary_Table'!$I$8,\"Yes\",\"NO\")","v":"Yes"}]
[null,null,null,null,null,null,null,null,null,null,null,null,0,{"$error":"#VALUE!"},{"$error":"#VALUE!"},0,{"$error":"#VALUE!"},{"$error":"#VALUE!"},0,{"$error":"#VALUE!"},{"$f":"IF(S1300<='Collection System Summary_Table'!$I$8,\"Yes\",\"NO\")","v":"Yes"}]
[null,null,null,null,null,null,null,null,null,null,null,null,0,{"$error":"#VALUE!"},{"$error":"#VALUE!"},0,{"$error":"#VALUE!"},{"$error":"#VALUE!"},0,{"$error":"#VALUE!"},{"$f":"IF(S1301<='Collection System Summary_Table'!$I$8,\"Yes\",\"NO\")","v":"Yes"}]
[null,null,null,null,null,null,null,null,null,null,null,null,0,{"$error":"#VALUE!"},{"$error":"#VALUE!"},0,{"$error":"#VALUE!"},{"$error":"#VALUE!"},0,{"$error":"#VALUE!"},{"$f":"IF(S1302<='Collection System Summary_Table'!$I$8,\"Yes\",\"NO\")","v":"Yes"}]
[null,null,null,null,null,null,null,null,null,null,null,null,0,{"$error":"#VALUE!"},{"$error":"#VALUE!"},0,{"$error":"#VALUE!"},{"$error":"#VALUE!"},0,{"$error":"#VALUE!"},{"$f":"IF(S1303<='Collection System Summary_Table'!$I$8,\"Yes\",\"NO\")","v":"Yes"}]
[null,null,null,null,null,null,null,null,null,null,null,null,0,{"$error":"#VALUE!"},{"$error":"#VALUE!"},0,{"$error":"#VALUE!"},{"$error":"#VALUE!"},0,{"$error":"#VALUE!"},{"$f":"IF(S1304<='Collection System Summary_Table'!$I$8,\"Yes\",\"NO\")","v":"Yes"}]
[null,null,null,null,null,null,null,null,null,null,null,null,0,{"$error":"#VALUE!"},{"$error":"#VALUE!"},0,{"$error":"#VALUE!"},{"$error":"#VALUE!"},0,{"$error":"#VALUE!"},{"$f":"IF(S1305<='Collection System Summary_Table'!$I$8,\"Yes\",\"NO\")","v":"Yes"}]
[null,null,null,null,null,null,null,null,null,null,null,null,0,{"$error":"#VALUE!"},{"$error":"#VALUE!"},0,{"$error":"#VALUE!"},{"$error":"#VALUE!"},0,{"$error":"#VALUE!"},{"$f":"IF(S1306<='Collection System Summary_Table'!$I$8,\"Yes\",\"NO\")","v":"Yes"}]
[null,null,null,null,null,null,null,null,null,null,null,null,0,{"$error":"#VALUE!"},{"$error":"#VALUE!"},0,{"$error":"#VALUE!"},{"$error":"#VALUE!"},0,{"$error":"#VALUE!"},{"$f":"IF(S1307<='Collection System Summary_Table'!$I$8,\"Yes\",\"NO\")","v":"Yes"}]
[null,null,null,null,null,null,null,null,null,null,null,null,0,{"$error":"#VALUE!"},{"$error":"#VALUE!"},0,{"$error":"#VALUE!"},{"$error":"#VALUE!"},0,{"$error":"#VALUE!"},{"$f":"IF(S1308<='Collection System Summary_Table'!$I$8,\"Yes\",\"NO\")","v":"Yes"}]
[null,null,null,null,null,null,null,null,null,null,null,null,0,{"$error":"#VALUE!"},{"$error":"#VALUE!"},0,{"$error":"#VALUE!"},{"$error":"#VALUE!"},0,{"$error":"#VALUE!"},{"$f":"IF(S1309<='Collection System Summary_Table'!$I$8,\"Yes\",\"NO\")","v":"Yes"}]
[null,null,null,null,null,null,null,null,null,null,null,null,0,{"$error":"#VALUE!"},{"$error":"#VALUE!"},0,{"$error":"#VALUE!"},{"$error":"#VALUE!"},0,{"$error":"#VALUE!"},{"$f":"IF(S1310<='Collection System Summary_Table'!$I$8,\"Yes\",\"NO\")","v":"Yes"}]
[null,null,null,null,null,null,null,null,null,null,null,null,0,{"$error":"#VALUE!"},{"$error":"#VALUE!"},0,{"$error":"#VALUE!"},{"$error":"#VALUE!"},0,{"$error":"#VALUE!"},{"$f":"IF(S1311<='Collection System Summary_Table'!$I$8,\"Yes\",\"NO\")","v":"Yes"}]
[null,null,null,null,null,null,null,null,null,null,null,null,0,{"$error":"#VALUE!"},{"$error":"#VALUE!"},0,{"$error":"#VALUE!"},{"$error":"#VALUE!"},0,{"$error":"#VALUE!"},{"$f":"IF(S1312<='Collection System Summary_Table'!$I$8,\"Yes\",\"NO\")","v":"Yes"}]
[null,null,null,null,null,null,null,null,null,null,null,null,0,{"$error":"#VALUE!"},{"$error":"#VALUE!"},0,{"$error":"#VALUE!"},{"$error":"#VALUE!"},0,{"$error":"#VALUE!"},{"$f":"IF(S1313<='Collection System Summary_Table'!$I$8,\"Yes\",\"NO\")","v":"Yes"}]
[null,null,null,null,null,null,null,null,null,null,null,null,0,{"$error":"#VALUE!"},{"$error":"#VALUE!"},0,{"$error":"#VALUE!"},{"$error":"#VALUE!"},0,{"$error":"#VALUE!"},{"$f":"IF(S1314<='Collection System Summary_Table'!$I$8,\"Yes\",\"NO\")","v":"Yes"}]
[null,null,null,null,null,null,null,null,null,null,null,null,0,{"$error":"#VALUE!"},{"$error":"#VALUE!"},0,{"$error":"#VALUE!"},{"$error":"#VALUE!"},0,{"$error":"#VALUE!"},{"$f":"IF(S1315<='Collection System Summary_Table'!$I$8,\"Yes\",\"NO\")","v":"Yes"}]
[null,null,null,null,null,null,null,null,null,null,null,null,0,{"$error":"#VALUE!"},{"$error":"#VALUE!"},0,{"$error":"#VALUE!"},{"$error":"#VALUE!"},0,{"$error":"#VALUE!"},{"$f":"IF(S1316<='Collection System Summary_Table'!$I$8,\"Yes\",\"NO\")","v":"Yes"}]
[null,null,null,null,null,null,null,null,null,null,null,null,0,{"$error":"#VALUE!"},{"$error":"#VALUE!"},0,{"$error":"#VALUE!"},{"$error":"#VALUE!"},0,{"$error":"#VALUE!"},{"$f":"IF(S1317<='Collection System Summary_Table'!$I$8,\"Yes\",\"NO\")","v":"Yes"}]
[null,null,null,null,null,null,null,null,null,null,null,null,0,{"$error":"#VALUE!"},{"$error":"#VALUE!"},0,{"$error":"#VALUE!"},{"$error":"#VALUE!"},0,{"$error":"#VALUE!"},{"$f":"IF(S1318<='Collection System Summary_Table'!$I$8,\"Yes\",\"NO\")","v":"Yes"}]
[null,null,null,null,null,null,null,null,null,null,null,null,0,{"$error":"#VALUE!"},{"$error":"#VALUE!"},0,{"$error":"#VALUE!"},{"$error":"#VALUE!"},0,{"$error":"#VALUE!"},{"$f":"IF(S1319<='Collection System Summary_Table'!$I$8,\"Yes\",\"NO\")","v":"Yes"}]
[null,null,null,null,null,null,null,null,null,null,null,null,0,{"$error":"#VALUE!"},{"$error":"#VALUE!"},0,{"$error":"#VALUE!"},{"$error":"#VALUE!"},0,{"$error":"#VALUE!"},{"$f":"IF(S1320<='Collection System Summary_Table'!$I$8,\"Yes\",\"NO\")","v":"Yes"}]
[null,null,null,null,null,null,null,null,null,null,null,null,0,{"$error":"#VALUE!"},{"$error":"#VALUE!"},0,{"$error":"#VALUE!"},{"$error":"#VALUE!"},0,{"$error":"#VALUE!"},{"$f":"IF(S1321<='Collection System Summary_Table'!$I$8,\"Yes\",\"NO\")","v":"Yes"}]
[null,null,null,null,null,null,null,null,null,null,null,null,0,{"$error":"#VALUE!"},{"$error":"#VALUE!"},0,{"$error":"#VALUE!"},{"$error":"#VALUE!"},0,{"$error":"#VALUE!"},{"$f":"IF(S1322<='Collection System Summary_Table'!$I$8,\"Yes\",\"NO\")","v":"Yes"}]
[null,null,null,null,null,null,null,null,null,null,null,null,0,{"$error":"#VALUE!"},{"$error":"#VALUE!"},0,{"$error":"#VALUE!"},{"$error":"#VALUE!"},0,{"$error":"#VALUE!"},{"$f":"IF(S1323<='Collection System Summary_Table'!$I$8,\"Yes\",\"NO\")","v":"Yes"}]
[null,null,null,null,null,null,null,null,null,null,null,null,0,{"$error":"#VALUE!"},{"$error":"#VALUE!"},0,{"$error":"#VALUE!"},{"$error":"#VALUE!"},0,{"$error":"#VALUE!"},{"$f":"IF(S1324<='Collection System Summary_Table'!$I$8,\"Yes\",\"NO\")","v":"Yes"}]
[null,null,null,null,null,null,null,null,null,null,null,null,0,{"$error":"#VALUE!"},{"$error":"#VALUE!"},0,{"$error":"#VALUE!"},{"$error":"#VALUE!"},0,{"$error":"#VALUE!"},{"$f":"IF(S1325<='Collection System Summary_Table'!$I$8,\"Yes\",\"NO\")","v":"Yes"}]
[null,null,null,null,null,null,null,null,null,null,null,null,0,{"$error":"#VALUE!"},{"$error":"#VALUE!"},0,{"$error":"#VALUE!"},{"$error":"#VALUE!"},0,{"$error":"#VALUE!"},{"$f":"IF(S1326<='Collection System Summary_Table'!$I$8,\"Yes\",\"NO\")","v":"Yes"}]
[null,null,null,null,null,null,null,null,null,null,null,null,0,{"$error":"#VALUE!"},{"$error":"#VALUE!"},0,{"$error":"#VALUE!"},{"$error":"#VALUE!"},0,{"$error":"#VALUE!"},{"$f":"IF(S1327<='Collection System Summary_Table'!$I$8,\"Yes\",\"NO\")","v":"Yes"}]
[null,null,null,null,null,null,null,null,null,null,null,null,0,{"$error":"#VALUE!"},{"$error":"#VALUE!"},0,{"$error":"#VALUE!"},{"$error":"#VALUE!"},0,{"$error":"#VALUE!"},{"$f":"IF(S1328<='Collection System Summary_Table'!$I$8,\"Yes\",\"NO\")","v":"Yes"}]
[null,null,null,null,null,null,null,null,null,null,null,null,0,{"$error":"#VALUE!"},{"$error":"#VALUE!"},0,{"$error":"#VALUE!"},{"$error":"#VALUE!"},0,{"$error":"#VALUE!"},{"$f":"IF(S1329<='Collection System Summary_Table'!$I$8,\"Yes\",\"NO\")","v":"Yes"}]
[null,null,null,null,null,null,null,null,null,null,null,null,0,{"$error":"#VALUE!"},{"$error":"#VALUE!"},0,{"$error":"#VALUE!"},{"$error":"#VALUE!"},0,{"$error":"#VALUE!"},{"$f":"IF(S1330<='Collection System Summary_Table'!$I$8,\"Yes\",\"NO\")","v":"Yes"}]
[null,null,null,null,null,null,null,null,null,null,null,null,0,{"$error":"#VALUE!"},{"$error":"#VALUE!"},0,{"$error":"#VALUE!"},{"$error":"#VALUE!"},0,{"$error":"#VALUE!"},{"$f":"IF(S1331<='Collection System Summary_Table'!$I$8,\"Yes\",\"NO\")","v":"Yes"}]
[null,null,null,null,null,null,null,null,null,null,null,null,0,{"$error":"#VALUE!"},{"$error":"#VALUE!"},0,{"$error":"#VALUE!"},{"$error":"#VALUE!"},0,{"$error":"#VALUE!"},{"$f":"IF(S1332<='Collection System Summary_Table'!$I$8,\"Yes\",\"NO\")","v":"Yes"}]
[null,null,null,null,null,null,null,null,null,null,null,null,0,{"$error":"#VALUE!"},{"$error":"#VALUE!"},0,{"$error":"#VALUE!"},{"$error":"#VALUE!"},0,{"$error":"#VALUE!"},{"$f":"IF(S1333<='Collection System Summary_Table'!$I$8,\"Yes\",\"NO\")","v":"Yes"}]
[null,null,null,null,null,null,null,null,null,null,null,null,0,{"$error":"#VALUE!"},{"$error":"#VALUE!"},0,{"$error":"#VALUE!"},{"$error":"#VALUE!"},0,{"$error":"#VALUE!"},{"$f":"IF(S1334<='Collection System Summary_Table'!$I$8,\"Yes\",\"NO\")","v":"Yes"}]
[null,null,null,null,null,null,null,null,null,null,null,null,0,{"$error":"#VALUE!"},{"$error":"#VALUE!"},0,{"$error":"#VALUE!"},{"$error":"#VALUE!"},0,{"$error":"#VALUE!"},{"$f":"IF(S1335<='Collection System Summary_Table'!$I$8,\"Yes\",\"NO\")","v":"Yes"}]
[null,null,null,null,null,null,null,null,null,null,null,null,0,{"$error":"#VALUE!"},{"$error":"#VALUE!"},0,{"$error":"#VALUE!"},{"$error":"#VALUE!"},0,{"$error":"#VALUE!"},{"$f":"IF(S1336<='Collection System Summary_Table'!$I$8,\"Yes\",\"NO\")","v":"Yes"}]
[null,null,null,null,null,null,null,null,null,null,null,null,0,{"$error":"#VALUE!"},{"$error":"#VALUE!"},0,{"$error":"#VALUE!"},{"$error":"#VALUE!"},0,{"$error":"#VALUE!"},{"$f":"IF(S1337<='Collection System Summary_Table'!$I$8,\"Yes\",\"NO\")","v":"Yes"}]
[null,null,null,null,null,null,null,null,null,null,null,null,0,{"$error":"#VALUE!"},{"$error":"#VALUE!"},0,{"$error":"#VALUE!"},{"$error":"#VALUE!"},0,{"$error":"#VALUE!"},{"$f":"IF(S1338<='Collection System Summary_Table'!$I$8,\"Yes\",\"NO\")","v":"Yes"}]
[null,null,null,null,null,null,null,null,null,null,null,null,0,{"$error":"#VALUE!"},{"$error":"#VALUE!"},0,{"$error":"#VALUE!"},{"$error":"#VALUE!"},0,{"$error":"#VALUE!"},{"$f":"IF(S1339<='Collection System Summary_Table'!$I$8,\"Yes\",\"NO\")","v":"Yes"}]
[null,null,null,null,null,null,null,null,null,null,null,null,0,{"$error":"#VALUE!"},{"$error":"#VALUE!"},0,{"$error":"#VALUE!"},{"$error":"#VALUE!"},0,{"$error":"#VALUE!"},{"$f":"IF(S1340<='Collection System Summary_Table'!$I$8,\"Yes\",\"NO\")","v":"Yes"}]
[null,null,null,null,null,null,null,null,null,null,null,null,0,{"$error":"#VALUE!"},{"$error":"#VALUE!"},0,{"$error":"#VALUE!"},{"$error":"#VALUE!"},0,{"$error":"#VALUE!"},{"$f":"IF(S1341<='Collection System Summary_Table'!$I$8,\"Yes\",\"NO\")","v":"Yes"}]
[null,null,null,null,null,null,null,null,null,null,null,null,0,{"$error":"#VALUE!"},{"$error":"#VALUE!"},0,{"$error":"#VALUE!"},{"$error":"#VALUE!"},0,{"$error":"#VALUE!"},{"$f":"IF(S1342<='Collection System Summary_Table'!$I$8,\"Yes\",\"NO\")","v":"Yes"}]
[null,null,null,null,null,null,null,null,null,null,null,null,0,{"$error":"#VALUE!"},{"$error":"#VALUE!"},0,{"$error":"#VALUE!"},{"$error":"#VALUE!"},0,{"$error":"#VALUE!"},{"$f":"IF(S1343<='Collection System Summary_Table'!$I$8,\"Yes\",\"NO\")","v":"Yes"}]
[null,null,null,null,null,null,null,null,null,null,null,null,0,{"$error":"#VALUE!"},{"$error":"#VALUE!"},0,{"$error":"#VALUE!"},{"$error":"#VALUE!"},0,{"$error":"#VALUE!"},{"$f":"IF(S1344<='Collection System Summary_Table'!$I$8,\"Yes\",\"NO\")","v":"Yes"}]
[null,null,null,null,null,null,null,null,null,null,null,null,0,{"$error":"#VALUE!"},{"$error":"#VALUE!"},0,{"$error":"#VALUE!"},{"$error":"#VALUE!"},0,{"$error":"#VALUE!"},{"$f":"IF(S1345<='Collection System Summary_Table'!$I$8,\"Yes\",\"NO\")","v":"Yes"}]
[null,null,null,null,null,null,null,null,null,null,null,null,0,{"$error":"#VALUE!"},{"$error":"#VALUE!"},0,{"$error":"#VALUE!"},{"$error":"#VALUE!"},0,{"$error":"#VALUE!"},{"$f":"IF(S1346<='Collection System Summary_Table'!$I$8,\"Yes\",\"NO\")","v":"Yes"}]
[null,null,null,null,null,null,null,null,null,null,null,null,0,{"$f":"IF(P1347=0,I1347+N1346,0)","v":{"$error":"#VALUE!"}},{"$error":"#VALUE!"},0,{"$error":"#VALUE!"},{"$error":"#VALUE!"},0,{"$error":"#VALUE!"},{"$f":"IF(S1347<='Collection System Summary_Table'!$I$8,\"Yes\",\"NO\")","v":"Yes"}]
[null,null,null,null,null,null,null,null,null,null,null,null,0,{"$error":"#VALUE!"},{"$f":"IF(AND(Q1348=0,P1348=0),K1348+O1347,0)","v":{"$error":"#VALUE!"}},0,{"$f":"IF(AND(P1348=0,N1348<($B$4+$P$1)),J1348,0)","v":{"$error":"#VALUE!"}},{"$f":"IF(AND(P1348=0,Q1348=0,O1348<($B$5+$Q$1)),K1348,0)","v":{"$error":"#VALUE!"}},{"$f":"S1347+L1348","v":0},{"$f":"IF(OR(P1348>1,Q1348>1,R1348>1),\"YES\",\"NO\")","v":{"$error":"#VALUE!"}},{"$f":"IF(S1348<='Collection System Summary_Table'!$I$8,\"Yes\",\"NO\")","v":"Yes"}]
[null,null,null,null,null,null,null,null,null,null,null,null,{"$f":"M1348+I1349","v":0},{"$error":"#VALUE!"},{"$error":"#VALUE!"},{"$f":"IF(M1349<=$B$3,I1349,0)","v":0},{"$error":"#VALUE!"},{"$error":"#VALUE!"},0,{"$error":"#VALUE!"},{"$f":"IF(S1349<='Collection System Summary_Table'!$I$8,\"Yes\",\"NO\")","v":"Yes"}]
[null,null,null,null,null,null,null,null,null,null,null,null,0,{"$error":"#VALUE!"},{"$error":"#VALUE!"},0,{"$error":"#VALUE!"},{"$error":"#VALUE!"},0,{"$error":"#VALUE!"},{"$f":"IF(S1350<='Collection System Summary_Table'!$I$8,\"Yes\",\"NO\")","v":"Yes"}]
[null,null,null,null,null,null,null,null,null,null,null,null,0,{"$error":"#VALUE!"},{"$error":"#VALUE!"},0,{"$error":"#VALUE!"},{"$error":"#VALUE!"},0,{"$error":"#VALUE!"},{"$f":"IF(S1351<='Collection System Summary_Table'!$I$8,\"Yes\",\"NO\")","v":"Yes"}]
[null,null,null,null,null,null,null,null,null,null,null,null,0,{"$error":"#VALUE!"},{"$error":"#VALUE!"},0,{"$error":"#VALUE!"},{"$error":"#VALUE!"},0,{"$error":"#VALUE!"},{"$f":"IF(S1352<='Collection System Summary_Table'!$I$8,\"Yes\",\"NO\")","v":"Yes"}]
[null,null,null,null,null,null,null,null,null,null,null,null,0,{"$error":"#VALUE!"},{"$error":"#VALUE!"},0,{"$error":"#VALUE!"},{"$error":"#VALUE!"},0,{"$error":"#VALUE!"},{"$f":"IF(S1353<='Collection System Summary_Table'!$I$8,\"Yes\",\"NO\")","v":"Yes"}]
[null,null,null,null,null,null,null,null,null,null,null,null,0,{"$error":"#VALUE!"},{"$error":"#VALUE!"},0,{"$error":"#VALUE!"},{"$error":"#VALUE!"},0,{"$error":"#VALUE!"},{"$f":"IF(S1354<='Collection System Summary_Table'!$I$8,\"Yes\",\"NO\")","v":"Yes"}]
[null,null,null,null,null,null,null,null,null,null,null,null,0,{"$error":"#VALUE!"},{"$error":"#VALUE!"},0,{"$error":"#VALUE!"},{"$error":"#VALUE!"},0,{"$error":"#VALUE!"},{"$f":"IF(S1355<='Collection System Summary_Table'!$I$8,\"Yes\",\"NO\")","v":"Yes"}]
[null,null,null,null,null,null,null,null,null,null,null,null,0,{"$error":"#VALUE!"},{"$error":"#VALUE!"},0,{"$error":"#VALUE!"},{"$error":"#VALUE!"},0,{"$error":"#VALUE!"},{"$f":"IF(S1356<='Collection System Summary_Table'!$I$8,\"Yes\",\"NO\")","v":"Yes"}]
[null,null,null,null,null,null,null,null,null,null,null,null,0,{"$error":"#VALUE!"},{"$error":"#VALUE!"},0,{"$error":"#VALUE!"},{"$error":"#VALUE!"},0,{"$error":"#VALUE!"},{"$f":"IF(S1357<='Collection System Summary_Table'!$I$8,\"Yes\",\"NO\")","v":"Yes"}]
[null,null,null,null,null,null,null,null,null,null,null,null,0,{"$error":"#VALUE!"},{"$error":"#VALUE!"},0,{"$error":"#VALUE!"},{"$error":"#VALUE!"},0,{"$error":"#VALUE!"},{"$f":"IF(S1358<='Collection System Summary_Table'!$I$8,\"Yes\",\"NO\")","v":"Yes"}]
[null,null,null,null,null,null,null,null,null,null,null,null,0,{"$error":"#VALUE!"},{"$error":"#VALUE!"},0,{"$error":"#VALUE!"},{"$error":"#VALUE!"},0,{"$error":"#VALUE!"},{"$f":"IF(S1359<='Collection System Summary_Table'!$I$8,\"Yes\",\"NO\")","v":"Yes"}]
[null,null,null,null,null,null,null,null,null,null,null,null,0,{"$error":"#VALUE!"},{"$error":"#VALUE!"},0,{"$error":"#VALUE!"},{"$error":"#VALUE!"},0,{"$error":"#VALUE!"},{"$f":"IF(S1360<='Collection System Summary_Table'!$I$8,\"Yes\",\"NO\")","v":"Yes"}]
[null,null,null,null,null,null,null,null,null,null,null,null,0,{"$error":"#VALUE!"},{"$error":"#VALUE!"},0,{"$error":"#VALUE!"},{"$error":"#VALUE!"},0,{"$error":"#VALUE!"},{"$f":"IF(S1361<='Collection System Summary_Table'!$I$8,\"Yes\",\"NO\")","v":"Yes"}]
[null,null,null,null,null,null,null,null,null,null,null,null,0,{"$error":"#VALUE!"},{"$error":"#VALUE!"},0,{"$error":"#VALUE!"},{"$error":"#VALUE!"},0,{"$error":"#VALUE!"},{"$f":"IF(S1362<='Collection System Summary_Table'!$I$8,\"Yes\",\"NO\")","v":"Yes"}]
[null,null,null,null,null,null,null,null,null,null,null,null,0,{"$error":"#VALUE!"},{"$error":"#VALUE!"},0,{"$error":"#VALUE!"},{"$error":"#VALUE!"},0,{"$error":"#VALUE!"},{"$f":"IF(S1363<='Collection System Summary_Table'!$I$8,\"Yes\",\"NO\")","v":"Yes"}]
[null,null,null,null,null,null,null,null,null,null,null,null,0,{"$error":"#VALUE!"},{"$error":"#VALUE!"},0,{"$error":"#VALUE!"},{"$error":"#VALUE!"},0,{"$error":"#VALUE!"},{"$f":"IF(S1364<='Collection System Summary_Table'!$I$8,\"Yes\",\"NO\")","v":"Yes"}]
[null,null,null,null,null,null,null,null,null,null,null,null,0,{"$error":"#VALUE!"},{"$error":"#VALUE!"},0,{"$error":"#VALUE!"},{"$error":"#VALUE!"},0,{"$error":"#VALUE!"},{"$f":"IF(S1365<='Collection System Summary_Table'!$I$8,\"Yes\",\"NO\")","v":"Yes"}]
[null,null,null,null,null,null,null,null,null,null,null,null,0,{"$error":"#VALUE!"},{"$error":"#VALUE!"},0,{"$error":"#VALUE!"},{"$error":"#VALUE!"},0,{"$error":"#VALUE!"},{"$f":"IF(S1366<='Collection System Summary_Table'!$I$8,\"Yes\",\"NO\")","v":"Yes"}]
[null,null,null,null,null,null,null,null,null,null,null,null,0,{"$error":"#VALUE!"},{"$error":"#VALUE!"},0,{"$error":"#VALUE!"},{"$error":"#VALUE!"},0,{"$error":"#VALUE!"},{"$f":"IF(S1367<='Collection System Summary_Table'!$I$8,\"Yes\",\"NO\")","v":"Yes"}]
[null,null,null,null,null,null,null,null,null,null,null,null,0,{"$error":"#VALUE!"},{"$error":"#VALUE!"},0,{"$error":"#VALUE!"},{"$error":"#VALUE!"},0,{"$error":"#VALUE!"},{"$f":"IF(S1368<='Collection System Summary_Table'!$I$8,\"Yes\",\"NO\")","v":"Yes"}]
[null,null,null,null,null,null,null,null,null,null,null,null,0,{"$error":"#VALUE!"},{"$error":"#VALUE!"},0,{"$error":"#VALUE!"},{"$error":"#VALUE!"},0,{"$error":"#VALUE!"},{"$f":"IF(S1369<='Collection System Summary_Table'!$I$8,\"Yes\",\"NO\")","v":"Yes"}]
[null,null,null,null,null,null,null,null,null,null,null,null,0,{"$error":"#VALUE!"},{"$error":"#VALUE!"},0,{"$error":"#VALUE!"},{"$error":"#VALUE!"},0,{"$error":"#VALUE!"},{"$f":"IF(S1370<='Collection System Summary_Table'!$I$8,\"Yes\",\"NO\")","v":"Yes"}]
[null,null,null,null,null,null,null,null,null,null,null,null,0,{"$error":"#VALUE!"},{"$error":"#VALUE!"},0,{"$error":"#VALUE!"},{"$error":"#VALUE!"},0,{"$error":"#VALUE!"},{"$f":"IF(S1371<='Collection System Summary_Table'!$I$8,\"Yes\",\"NO\")","v":"Yes"}]
[null,null,null,null,null,null,null,null,null,null,null,null,0,{"$error":"#VALUE!"},{"$error":"#VALUE!"},0,{"$error":"#VALUE!"},{"$error":"#VALUE!"},0,{"$error":"#VALUE!"},{"$f":"IF(S1372<='Collection System Summary_Table'!$I$8,\"Yes\",\"NO\")","v":"Yes"}]
[null,null,null,null,null,null,null,null,null,null,null,null,0,{"$error":"#VALUE!"},{"$error":"#VALUE!"},0,{"$error":"#VALUE!"},{"$error":"#VALUE!"},0,{"$error":"#VALUE!"},{"$f":"IF(S1373<='Collection System Summary_Table'!$I$8,\"Yes\",\"NO\")","v":"Yes"}]
[null,null,null,null,null,null,null,null,null,null,null,null,0,{"$error":"#VALUE!"},{"$error":"#VALUE!"},0,{"$error":"#VALUE!"},{"$error":"#VALUE!"},0,{"$error":"#VALUE!"},{"$f":"IF(S1374<='Collection System Summary_Table'!$I$8,\"Yes\",\"NO\")","v":"Yes"}]
[null,null,null,null,null,null,null,null,null,null,null,null,0,{"$error":"#VALUE!"},{"$error":"#VALUE!"},0,{"$error":"#VALUE!"},{"$error":"#VALUE!"},0,{"$error":"#VALUE!"},{"$f":"IF(S1375<='Collection System Summary_Table'!$I$8,\"Yes\",\"NO\")","v":"Yes"}]
[null,null,null,null,null,null,null,null,null,null,null,null,0,{"$error":"#VALUE!"},{"$error":"#VALUE!"},0,{"$error":"#VALUE!"},{"$error":"#VALUE!"},0,{"$error":"#VALUE!"},{"$f":"IF(S1376<='Collection System Summary_Table'!$I$8,\"Yes\",\"NO\")","v":"Yes"}]
[null,null,null,null,null,null,null,null,null,null,null,null,0,{"$error":"#VALUE!"},{"$error":"#VALUE!"},0,{"$error":"#VALUE!"},{"$error":"#VALUE!"},0,{"$error":"#VALUE!"},{"$f":"IF(S1377<='Collection System Summary_Table'!$I$8,\"Yes\",\"NO\")","v":"Yes"}]
[null,null,null,null,null,null,null,null,null,null,null,null,0,{"$error":"#VALUE!"},{"$error":"#VALUE!"},0,{"$error":"#VALUE!"},{"$error":"#VALUE!"},0,{"$error":"#VALUE!"},{"$f":"IF(S1378<='Collection System Summary_Table'!$I$8,\"Yes\",\"NO\")","v":"Yes"}]
[null,null,null,null,null,null,null,null,null,null,null,null,0,{"$error":"#VALUE!"},{"$error":"#VALUE!"},0,{"$error":"#VALUE!"},{"$error":"#VALUE!"},0,{"$error":"#VALUE!"},{"$f":"IF(S1379<='Collection System Summary_Table'!$I$8,\"Yes\",\"NO\")","v":"Yes"}]
[null,null,null,null,null,null,null,null,null,null,null,null,0,{"$error":"#VALUE!"},{"$error":"#VALUE!"},0,{"$error":"#VALUE!"},{"$error":"#VALUE!"},0,{"$error":"#VALUE!"},{"$f":"IF(S1380<='Collection System Summary_Table'!$I$8,\"Yes\",\"NO\")","v":"Yes"}]
[null,null,null,null,null,null,null,null,null,null,null,null,0,{"$error":"#VALUE!"},{"$error":"#VALUE!"},0,{"$error":"#VALUE!"},{"$error":"#VALUE!"},0,{"$error":"#VALUE!"},{"$f":"IF(S1381<='Collection System Summary_Table'!$I$8,\"Yes\",\"NO\")","v":"Yes"}]
[null,null,null,null,null,null,null,null,null,null,null,null,0,{"$error":"#VALUE!"},{"$error":"#VALUE!"},0,{"$error":"#VALUE!"},{"$error":"#VALUE!"},0,{"$error":"#VALUE!"},{"$f":"IF(S1382<='Collection System Summary_Table'!$I$8,\"Yes\",\"NO\")","v":"Yes"}]
[null,null,null,null,null,null,null,null,null,null,null,null,0,{"$error":"#VALUE!"},{"$error":"#VALUE!"},0,{"$error":"#VALUE!"},{"$error":"#VALUE!"},0,{"$error":"#VALUE!"},{"$f":"IF(S1383<='Collection System Summary_Table'!$I$8,\"Yes\",\"NO\")","v":"Yes"}]
[null,null,null,null,null,null,null,null,null,null,null,null,0,{"$error":"#VALUE!"},{"$error":"#VALUE!"},0,{"$error":"#VALUE!"},{"$error":"#VALUE!"},0,{"$error":"#VALUE!"},{"$f":"IF(S1384<='Collection System Summary_Table'!$I$8,\"Yes\",\"NO\")","v":"Yes"}]
[null,null,null,null,null,null,null,null,null,null,null,null,0,{"$error":"#VALUE!"},{"$error":"#VALUE!"},0,{"$error":"#VALUE!"},{"$error":"#VALUE!"},0,{"$error":"#VALUE!"},{"$f":"IF(S1385<='Collection System Summary_Table'!$I$8,\"Yes\",\"NO\")","v":"Yes"}]
[null,null,null,null,null,null,null,null,null,null,null,null,0,{"$error":"#VALUE!"},{"$error":"#VALUE!"},0,{"$error":"#VALUE!"},{"$error":"#VALUE!"},0,{"$error":"#VALUE!"},{"$f":"IF(S1386<='Collection System Summary_Table'!$I$8,\"Yes\",\"NO\")","v":"Yes"}]
[null,null,null,null,null,null,null,null,null,null,null,null,0,{"$error":"#VALUE!"},{"$error":"#VALUE!"},0,{"$error":"#VALUE!"},{"$error":"#VALUE!"},0,{"$error":"#VALUE!"},{"$f":"IF(S1387<='Collection System Summary_Table'!$I$8,\"Yes\",\"NO\")","v":"Yes"}]
[null,null,null,null,null,null,null,null,null,null,null,null,0,{"$error":"#VALUE!"},{"$error":"#VALUE!"},0,{"$error":"#VALUE!"},{"$error":"#VALUE!"},0,{"$error":"#VALUE!"},{"$f":"IF(S1388<='Collection System Summary_Table'!$I$8,\"Yes\",\"NO\")","v":"Yes"}]
[null,null,null,null,null,null,null,null,null,null,null,null,0,{"$error":"#VALUE!"},{"$error":"#VALUE!"},0,{"$error":"#VALUE!"},{"$error":"#VALUE!"},0,{"$error":"#VALUE!"},{"$f":"IF(S1389<='Collection System Summary_Table'!$I$8,\"Yes\",\"NO\")","v":"Yes"}]
[null,null,null,null,null,null,null,null,null,null,null,null,0,{"$error":"#VALUE!"},{"$error":"#VALUE!"},0,{"$error":"#VALUE!"},{"$error":"#VALUE!"},0,{"$error":"#VALUE!"},{"$f":"IF(S1390<='Collection System Summary_Table'!$I$8,\"Yes\",\"NO\")","v":"Yes"}]
[null,null,null,null,null,null,null,null,null,null,null,null,0,{"$error":"#VALUE!"},{"$error":"#VALUE!"},0,{"$error":"#VALUE!"},{"$error":"#VALUE!"},0,{"$error":"#VALUE!"},{"$f":"IF(S1391<='Collection System Summary_Table'!$I$8,\"Yes\",\"NO\")","v":"Yes"}]
[null,null,null,null,null,null,null,null,null,null,null,null,0,{"$error":"#VALUE!"},{"$error":"#VALUE!"},0,{"$error":"#VALUE!"},{"$error":"#VALUE!"},0,{"$error":"#VALUE!"},{"$f":"IF(S1392<='Collection System Summary_Table'!$I$8,\"Yes\",\"NO\")","v":"Yes"}]
[null,null,null,null,null,null,null,null,null,null,null,null,0,{"$error":"#VALUE!"},{"$error":"#VALUE!"},0,{"$error":"#VALUE!"},{"$error":"#VALUE!"},0,{"$error":"#VALUE!"},{"$f":"IF(S1393<='Collection System Summary_Table'!$I$8,\"Yes\",\"NO\")","v":"Yes"}]
[null,null,null,null,null,null,null,null,null,null,null,null,0,{"$error":"#VALUE!"},{"$error":"#VALUE!"},0,{"$error":"#VALUE!"},{"$error":"#VALUE!"},0,{"$error":"#VALUE!"},{"$f":"IF(S1394<='Collection System Summary_Table'!$I$8,\"Yes\",\"NO\")","v":"Yes"}]
[null,null,null,null,null,null,null,null,null,null,null,null,0,{"$error":"#VALUE!"},{"$error":"#VALUE!"},0,{"$error":"#VALUE!"},{"$error":"#VALUE!"},0,{"$error":"#VALUE!"},{"$f":"IF(S1395<='Collection System Summary_Table'!$I$8,\"Yes\",\"NO\")","v":"Yes"}]
[null,null,null,null,null,null,null,null,null,null,null,null,0,{"$error":"#VALUE!"},{"$error":"#VALUE!"},0,{"$error":"#VALUE!"},{"$error":"#VALUE!"},0,{"$error":"#VALUE!"},{"$f":"IF(S1396<='Collection System Summary_Table'!$I$8,\"Yes\",\"NO\")","v":"Yes"}]
[null,null,null,null,null,null,null,null,null,null,null,null,0,{"$error":"#VALUE!"},{"$error":"#VALUE!"},0,{"$error":"#VALUE!"},{"$error":"#VALUE!"},0,{"$error":"#VALUE!"},{"$f":"IF(S1397<='Collection System Summary_Table'!$I$8,\"Yes\",\"NO\")","v":"Yes"}]
[null,null,null,null,null,null,null,null,null,null,null,null,0,{"$error":"#VALUE!"},{"$error":"#VALUE!"},0,{"$error":"#VALUE!"},{"$error":"#VALUE!"},0,{"$error":"#VALUE!"},{"$f":"IF(S1398<='Collection System Summary_Table'!$I$8,\"Yes\",\"NO\")","v":"Yes"}]
[null,null,null,null,null,null,null,null,null,null,null,null,0,{"$error":"#VALUE!"},{"$error":"#VALUE!"},0,{"$error":"#VALUE!"},{"$error":"#VALUE!"},0,{"$error":"#VALUE!"},{"$f":"IF(S1399<='Collection System Summary_Table'!$I$8,\"Yes\",\"NO\")","v":"Yes"}]
[null,null,null,null,null,null,null,null,null,null,null,null,0,{"$error":"#VALUE!"},{"$error":"#VALUE!"},0,{"$error":"#VALUE!"},{"$error":"#VALUE!"},0,{"$error":"#VALUE!"},{"$f":"IF(S1400<='Collection System Summary_Table'!$I$8,\"Yes\",\"NO\")","v":"Yes"}]
[null,null,null,null,null,null,null,null,null,null,null,null,0,{"$error":"#VALUE!"},{"$error":"#VALUE!"},0,{"$error":"#VALUE!"},{"$error":"#VALUE!"},0,{"$error":"#VALUE!"},{"$f":"IF(S1401<='Collection System Summary_Table'!$I$8,\"Yes\",\"NO\")","v":"Yes"}]
[null,null,null,null,null,null,null,null,null,null,null,null,0,{"$error":"#VALUE!"},{"$error":"#VALUE!"},0,{"$error":"#VALUE!"},{"$error":"#VALUE!"},0,{"$error":"#VALUE!"},{"$f":"IF(S1402<='Collection System Summary_Table'!$I$8,\"Yes\",\"NO\")","v":"Yes"}]
[null,null,null,null,null,null,null,null,null,null,null,null,0,{"$error":"#VALUE!"},{"$error":"#VALUE!"},0,{"$error":"#VALUE!"},{"$error":"#VALUE!"},0,{"$error":"#VALUE!"},{"$f":"IF(S1403<='Collection System Summary_Table'!$I$8,\"Yes\",\"NO\")","v":"Yes"}]
[null,null,null,null,null,null,null,null,null,null,null,null,0,{"$error":"#VALUE!"},{"$error":"#VALUE!"},0,{"$error":"#VALUE!"},{"$error":"#VALUE!"},0,{"$error":"#VALUE!"},{"$f":"IF(S1404<='Collection System Summary_Table'!$I$8,\"Yes\",\"NO\")","v":"Yes"}]
[null,null,null,null,null,null,null,null,null,null,null,null,0,{"$error":"#VALUE!"},{"$error":"#VALUE!"},0,{"$error":"#VALUE!"},{"$error":"#VALUE!"},0,{"$error":"#VALUE!"},{"$f":"IF(S1405<='Collection System Summary_Table'!$I$8,\"Yes\",\"NO\")","v":"Yes"}]
[null,null,null,null,null,null,null,null,null,null,null,null,0,{"$error":"#VALUE!"},{"$error":"#VALUE!"},0,{"$error":"#VALUE!"},{"$error":"#VALUE!"},0,{"$error":"#VALUE!"},{"$f":"IF(S1406<='Collection System Summary_Table'!$I$8,\"Yes\",\"NO\")","v":"Yes"}]
[null,null,null,null,null,null,null,null,null,null,null,null,0,{"$error":"#VALUE!"},{"$error":"#VALUE!"},0,{"$error":"#VALUE!"},{"$error":"#VALUE!"},0,{"$error":"#VALUE!"},{"$f":"IF(S1407<='Collection System Summary_Table'!$I$8,\"Yes\",\"NO\")","v":"Yes"}]
[null,null,null,null,null,null,null,null,null,null,null,null,0,{"$error":"#VALUE!"},{"$error":"#VALUE!"},0,{"$error":"#VALUE!"},{"$error":"#VALUE!"},0,{"$error":"#VALUE!"},{"$f":"IF(S1408<='Collection System Summary_Table'!$I$8,\"Yes\",\"NO\")","v":"Yes"}]
[null,null,null,null,null,null,null,null,null,null,null,null,0,{"$error":"#VALUE!"},{"$error":"#VALUE!"},0,{"$error":"#VALUE!"},{"$error":"#VALUE!"},0,{"$error":"#VALUE!"},{"$f":"IF(S1409<='Collection System Summary_Table'!$I$8,\"Yes\",\"NO\")","v":"Yes"}]
[null,null,null,null,null,null,null,null,null,null,null,null,0,{"$error":"#VALUE!"},{"$error":"#VALUE!"},0,{"$error":"#VALUE!"},{"$error":"#VALUE!"},0,{"$error":"#VALUE!"},{"$f":"IF(S1410<='Collection System Summary_Table'!$I$8,\"Yes\",\"NO\")","v":"Yes"}]
[null,null,null,null,null,null,null,null,null,null,null,null,0,{"$f":"IF(P1411=0,I1411+N1410,0)","v":{"$error":"#VALUE!"}},{"$error":"#VALUE!"},0,{"$error":"#VALUE!"},{"$error":"#VALUE!"},0,{"$error":"#VALUE!"},{"$f":"IF(S1411<='Collection System Summary_Table'!$I$8,\"Yes\",\"NO\")","v":"Yes"}]
[null,null,null,null,null,null,null,null,null,null,null,null,0,{"$error":"#VALUE!"},{"$f":"IF(AND(Q1412=0,P1412=0),K1412+O1411,0)","v":{"$error":"#VALUE!"}},0,{"$f":"IF(AND(P1412=0,N1412<($B$4+$P$1)),J1412,0)","v":{"$error":"#VALUE!"}},{"$f":"IF(AND(P1412=0,Q1412=0,O1412<($B$5+$Q$1)),K1412,0)","v":{"$error":"#VALUE!"}},{"$f":"S1411+L1412","v":0},{"$f":"IF(OR(P1412>1,Q1412>1,R1412>1),\"YES\",\"NO\")","v":{"$error":"#VALUE!"}},{"$f":"IF(S1412<='Collection System Summary_Table'!$I$8,\"Yes\",\"NO\")","v":"Yes"}]
[null,null,null,null,null,null,null,null,null,null,null,null,{"$f":"M1412+I1413","v":0},{"$error":"#VALUE!"},{"$error":"#VALUE!"},{"$f":"IF(M1413<=$B$3,I1413,0)","v":0},{"$error":"#VALUE!"},{"$error":"#VALUE!"},0,{"$error":"#VALUE!"},{"$f":"IF(S1413<='Collection System Summary_Table'!$I$8,\"Yes\",\"NO\")","v":"Yes"}]
[null,null,null,null,null,null,null,null,null,null,null,null,0,{"$error":"#VALUE!"},{"$error":"#VALUE!"},0,{"$error":"#VALUE!"},{"$error":"#VALUE!"},0,{"$error":"#VALUE!"},{"$f":"IF(S1414<='Collection System Summary_Table'!$I$8,\"Yes\",\"NO\")","v":"Yes"}]
[null,null,null,null,null,null,null,null,null,null,null,null,0,{"$error":"#VALUE!"},{"$error":"#VALUE!"},0,{"$error":"#VALUE!"},{"$error":"#VALUE!"},0,{"$error":"#VALUE!"},{"$f":"IF(S1415<='Collection System Summary_Table'!$I$8,\"Yes\",\"NO\")","v":"Yes"}]
[null,null,null,null,null,null,null,null,null,null,null,null,0,{"$error":"#VALUE!"},{"$error":"#VALUE!"},0,{"$error":"#VALUE!"},{"$error":"#VALUE!"},0,{"$error":"#VALUE!"},{"$f":"IF(S1416<='Collection System Summary_Table'!$I$8,\"Yes\",\"NO\")","v":"Yes"}]
[null,null,null,null,null,null,null,null,null,null,null,null,0,{"$error":"#VALUE!"},{"$error":"#VALUE!"},0,{"$error":"#VALUE!"},{"$error":"#VALUE!"},0,{"$error":"#VALUE!"},{"$f":"IF(S1417<='Collection System Summary_Table'!$I$8,\"Yes\",\"NO\")","v":"Yes"}]
[null,null,null,null,null,null,null,null,null,null,null,null,0,{"$error":"#VALUE!"},{"$error":"#VALUE!"},0,{"$error":"#VALUE!"},{"$error":"#VALUE!"},0,{"$error":"#VALUE!"},{"$f":"IF(S1418<='Collection System Summary_Table'!$I$8,\"Yes\",\"NO\")","v":"Yes"}]
[null,null,null,null,null,null,null,null,null,null,null,null,0,{"$error":"#VALUE!"},{"$error":"#VALUE!"},0,{"$error":"#VALUE!"},{"$error":"#VALUE!"},0,{"$error":"#VALUE!"},{"$f":"IF(S1419<='Collection System Summary_Table'!$I$8,\"Yes\",\"NO\")","v":"Yes"}]
[null,null,null,null,null,null,null,null,null,null,null,null,0,{"$error":"#VALUE!"},{"$error":"#VALUE!"},0,{"$error":"#VALUE!"},{"$error":"#VALUE!"},0,{"$error":"#VALUE!"},{"$f":"IF(S1420<='Collection System Summary_Table'!$I$8,\"Yes\",\"NO\")","v":"Yes"}]
[null,null,null,null,null,null,null,null,null,null,null,null,0,{"$error":"#VALUE!"},{"$error":"#VALUE!"},0,{"$error":"#VALUE!"},{"$error":"#VALUE!"},0,{"$error":"#VALUE!"},{"$f":"IF(S1421<='Collection System Summary_Table'!$I$8,\"Yes\",\"NO\")","v":"Yes"}]
[null,null,null,null,null,null,null,null,null,null,null,null,0,{"$error":"#VALUE!"},{"$error":"#VALUE!"},0,{"$error":"#VALUE!"},{"$error":"#VALUE!"},0,{"$error":"#VALUE!"},{"$f":"IF(S1422<='Collection System Summary_Table'!$I$8,\"Yes\",\"NO\")","v":"Yes"}]
[null,null,null,null,null,null,null,null,null,null,null,null,0,{"$error":"#VALUE!"},{"$error":"#VALUE!"},0,{"$error":"#VALUE!"},{"$error":"#VALUE!"},0,{"$error":"#VALUE!"},{"$f":"IF(S1423<='Collection System Summary_Table'!$I$8,\"Yes\",\"NO\")","v":"Yes"}]
[null,null,null,null,null,null,null,null,null,null,null,null,0,{"$error":"#VALUE!"},{"$error":"#VALUE!"},0,{"$error":"#VALUE!"},{"$error":"#VALUE!"},0,{"$error":"#VALUE!"},{"$f":"IF(S1424<='Collection System Summary_Table'!$I$8,\"Yes\",\"NO\")","v":"Yes"}]
[null,null,null,null,null,null,null,null,null,null,null,null,0,{"$error":"#VALUE!"},{"$error":"#VALUE!"},0,{"$error":"#VALUE!"},{"$error":"#VALUE!"},0,{"$error":"#VALUE!"},{"$f":"IF(S1425<='Collection System Summary_Table'!$I$8,\"Yes\",\"NO\")","v":"Yes"}]
[null,null,null,null,null,null,null,null,null,null,null,null,0,{"$error":"#VALUE!"},{"$error":"#VALUE!"},0,{"$error":"#VALUE!"},{"$error":"#VALUE!"},0,{"$error":"#VALUE!"},{"$f":"IF(S1426<='Collection System Summary_Table'!$I$8,\"Yes\",\"NO\")","v":"Yes"}]
[null,null,null,null,null,null,null,null,null,null,null,null,0,{"$error":"#VALUE!"},{"$error":"#VALUE!"},0,{"$error":"#VALUE!"},{"$error":"#VALUE!"},0,{"$error":"#VALUE!"},{"$f":"IF(S1427<='Collection System Summary_Table'!$I$8,\"Yes\",\"NO\")","v":"Yes"}]
[null,null,null,null,null,null,null,null,null,null,null,null,0,{"$error":"#VALUE!"},{"$error":"#VALUE!"},0,{"$error":"#VALUE!"},{"$error":"#VALUE!"},0,{"$error":"#VALUE!"},{"$f":"IF(S1428<='Collection System Summary_Table'!$I$8,\"Yes\",\"NO\")","v":"Yes"}]
[null,null,null,null,null,null,null,null,null,null,null,null,0,{"$error":"#VALUE!"},{"$error":"#VALUE!"},0,{"$error":"#VALUE!"},{"$error":"#VALUE!"},0,{"$error":"#VALUE!"},{"$f":"IF(S1429<='Collection System Summary_Table'!$I$8,\"Yes\",\"NO\")","v":"Yes"}]
[null,null,null,null,null,null,null,null,null,null,null,null,0,{"$error":"#VALUE!"},{"$error":"#VALUE!"},0,{"$error":"#VALUE!"},{"$error":"#VALUE!"},0,{"$error":"#VALUE!"},{"$f":"IF(S1430<='Collection System Summary_Table'!$I$8,\"Yes\",\"NO\")","v":"Yes"}]
[null,null,null,null,null,null,null,null,null,null,null,null,0,{"$error":"#VALUE!"},{"$error":"#VALUE!"},0,{"$error":"#VALUE!"},{"$error":"#VALUE!"},0,{"$error":"#VALUE!"},{"$f":"IF(S1431<='Collection System Summary_Table'!$I$8,\"Yes\",\"NO\")","v":"Yes"}]
[null,null,null,null,null,null,null,null,null,null,null,null,0,{"$error":"#VALUE!"},{"$error":"#VALUE!"},0,{"$error":"#VALUE!"},{"$error":"#VALUE!"},0,{"$error":"#VALUE!"},{"$f":"IF(S1432<='Collection System Summary_Table'!$I$8,\"Yes\",\"NO\")","v":"Yes"}]
[null,null,null,null,null,null,null,null,null,null,null,null,0,{"$error":"#VALUE!"},{"$error":"#VALUE!"},0,{"$error":"#VALUE!"},{"$error":"#VALUE!"},0,{"$error":"#VALUE!"},{"$f":"IF(S1433<='Collection System Summary_Table'!$I$8,\"Yes\",\"NO\")","v":"Yes"}]
[null,null,null,null,null,null,null,null,null,null,null,null,0,{"$error":"#VALUE!"},{"$error":"#VALUE!"},0,{"$error":"#VALUE!"},{"$error":"#VALUE!"},0,{"$error":"#VALUE!"},{"$f":"IF(S1434<='Collection System Summary_Table'!$I$8,\"Yes\",\"NO\")","v":"Yes"}]
[null,null,null,null,null,null,null,null,null,null,null,null,0,{"$error":"#VALUE!"},{"$error":"#VALUE!"},0,{"$error":"#VALUE!"},{"$error":"#VALUE!"},0,{"$error":"#VALUE!"},{"$f":"IF(S1435<='Collection System Summary_Table'!$I$8,\"Yes\",\"NO\")","v":"Yes"}]
[null,null,null,null,null,null,null,null,null,null,null,null,0,{"$error":"#VALUE!"},{"$error":"#VALUE!"},0,{"$error":"#VALUE!"},{"$error":"#VALUE!"},0,{"$error":"#VALUE!"},{"$f":"IF(S1436<='Collection System Summary_Table'!$I$8,\"Yes\",\"NO\")","v":"Yes"}]
[null,null,null,null,null,null,null,null,null,null,null,null,0,{"$error":"#VALUE!"},{"$error":"#VALUE!"},0,{"$error":"#VALUE!"},{"$error":"#VALUE!"},0,{"$error":"#VALUE!"},{"$f":"IF(S1437<='Collection System Summary_Table'!$I$8,\"Yes\",\"NO\")","v":"Yes"}]
[null,null,null,null,null,null,null,null,null,null,null,null,0,{"$error":"#VALUE!"},{"$error":"#VALUE!"},0,{"$error":"#VALUE!"},{"$error":"#VALUE!"},0,{"$error":"#VALUE!"},{"$f":"IF(S1438<='Collection System Summary_Table'!$I$8,\"Yes\",\"NO\")","v":"Yes"}]
[null,null,null,null,null,null,null,null,null,null,null,null,0,{"$error":"#VALUE!"},{"$error":"#VALUE!"},0,{"$error":"#VALUE!"},{"$error":"#VALUE!"},0,{"$error":"#VALUE!"},{"$f":"IF(S1439<='Collection System Summary_Table'!$I$8,\"Yes\",\"NO\")","v":"Yes"}]
[null,null,null,null,null,null,null,null,null,null,null,null,0,{"$error":"#VALUE!"},{"$error":"#VALUE!"},0,{"$error":"#VALUE!"},{"$error":"#VALUE!"},0,{"$error":"#VALUE!"},{"$f":"IF(S1440<='Collection System Summary_Table'!$I$8,\"Yes\",\"NO\")","v":"Yes"}]
[null,null,null,null,null,null,null,null,null,null,null,null,0,{"$error":"#VALUE!"},{"$error":"#VALUE!"},0,{"$error":"#VALUE!"},{"$error":"#VALUE!"},0,{"$error":"#VALUE!"},{"$f":"IF(S1441<='Collection System Summary_Table'!$I$8,\"Yes\",\"NO\")","v":"Yes"}]
[null,null,null,null,null,null,null,null,null,null,null,null,0,{"$error":"#VALUE!"},{"$error":"#VALUE!"},0,{"$error":"#VALUE!"},{"$error":"#VALUE!"},0,{"$error":"#VALUE!"},{"$f":"IF(S1442<='Collection System Summary_Table'!$I$8,\"Yes\",\"NO\")","v":"Yes"}]
[null,null,null,null,null,null,null,null,null,null,null,null,0,{"$error":"#VALUE!"},{"$error":"#VALUE!"},0,{"$error":"#VALUE!"},{"$error":"#VALUE!"},0,{"$error":"#VALUE!"},{"$f":"IF(S1443<='Collection System Summary_Table'!$I$8,\"Yes\",\"NO\")","v":"Yes"}]
[null,null,null,null,null,null,null,null,null,null,null,null,0,{"$error":"#VALUE!"},{"$error":"#VALUE!"},0,{"$error":"#VALUE!"},{"$error":"#VALUE!"},0,{"$error":"#VALUE!"},{"$f":"IF(S1444<='Collection System Summary_Table'!$I$8,\"Yes\",\"NO\")","v":"Yes"}]
[null,null,null,null,null,null,null,null,null,null,null,null,0,{"$error":"#VALUE!"},{"$error":"#VALUE!"},0,{"$error":"#VALUE!"},{"$error":"#VALUE!"},0,{"$error":"#VALUE!"},{"$f":"IF(S1445<='Collection System Summary_Table'!$I$8,\"Yes\",\"NO\")","v":"Yes"}]
[null,null,null,null,null,null,null,null,null,null,null,null,0,{"$error":"#VALUE!"},{"$error":"#VALUE!"},0,{"$error":"#VALUE!"},{"$error":"#VALUE!"},0,{"$error":"#VALUE!"},{"$f":"IF(S1446<='Collection System Summary_Table'!$I$8,\"Yes\",\"NO\")","v":"Yes"}]
[null,null,null,null,null,null,null,null,null,null,null,null,0,{"$error":"#VALUE!"},{"$error":"#VALUE!"},0,{"$error":"#VALUE!"},{"$error":"#VALUE!"},0,{"$error":"#VALUE!"},{"$f":"IF(S1447<='Collection System Summary_Table'!$I$8,\"Yes\",\"NO\")","v":"Yes"}]
[null,null,null,null,null,null,null,null,null,null,null,null,0,{"$error":"#VALUE!"},{"$error":"#VALUE!"},0,{"$error":"#VALUE!"},{"$error":"#VALUE!"},0,{"$error":"#VALUE!"},{"$f":"IF(S1448<='Collection System Summary_Table'!$I$8,\"Yes\",\"NO\")","v":"Yes"}]
[null,null,null,null,null,null,null,null,null,null,null,null,0,{"$error":"#VALUE!"},{"$error":"#VALUE!"},0,{"$error":"#VALUE!"},{"$error":"#VALUE!"},0,{"$error":"#VALUE!"},{"$f":"IF(S1449<='Collection System Summary_Table'!$I$8,\"Yes\",\"NO\")","v":"Yes"}]
[null,null,null,null,null,null,null,null,null,null,null,null,0,{"$error":"#VALUE!"},{"$error":"#VALUE!"},0,{"$error":"#VALUE!"},{"$error":"#VALUE!"},0,{"$error":"#VALUE!"},{"$f":"IF(S1450<='Collection System Summary_Table'!$I$8,\"Yes\",\"NO\")","v":"Yes"}]
[null,null,null,null,null,null,null,null,null,null,null,null,0,{"$error":"#VALUE!"},{"$error":"#VALUE!"},0,{"$error":"#VALUE!"},{"$error":"#VALUE!"},0,{"$error":"#VALUE!"},{"$f":"IF(S1451<='Collection System Summary_Table'!$I$8,\"Yes\",\"NO\")","v":"Yes"}]
[null,null,null,null,null,null,null,null,null,null,null,null,0,{"$error":"#VALUE!"},{"$error":"#VALUE!"},0,{"$error":"#VALUE!"},{"$error":"#VALUE!"},0,{"$error":"#VALUE!"},{"$f":"IF(S1452<='Collection System Summary_Table'!$I$8,\"Yes\",\"NO\")","v":"Yes"}]
[null,null,null,null,null,null,null,null,null,null,null,null,0,{"$error":"#VALUE!"},{"$error":"#VALUE!"},0,{"$error":"#VALUE!"},{"$error":"#VALUE!"},0,{"$error":"#VALUE!"},{"$f":"IF(S1453<='Collection System Summary_Table'!$I$8,\"Yes\",\"NO\")","v":"Yes"}]
[null,null,null,null,null,null,null,null,null,null,null,null,0,{"$error":"#VALUE!"},{"$error":"#VALUE!"},0,{"$error":"#VALUE!"},{"$error":"#VALUE!"},0,{"$error":"#VALUE!"},{"$f":"IF(S1454<='Collection System Summary_Table'!$I$8,\"Yes\",\"NO\")","v":"Yes"}]
[null,null,null,null,null,null,null,null,null,null,null,null,0,{"$error":"#VALUE!"},{"$error":"#VALUE!"},0,{"$error":"#VALUE!"},{"$error":"#VALUE!"},0,{"$error":"#VALUE!"},{"$f":"IF(S1455<='Collection System Summary_Table'!$I$8,\"Yes\",\"NO\")","v":"Yes"}]
[null,null,null,null,null,null,null,null,null,null,null,null,0,{"$error":"#VALUE!"},{"$error":"#VALUE!"},0,{"$error":"#VALUE!"},{"$error":"#VALUE!"},0,{"$error":"#VALUE!"},{"$f":"IF(S1456<='Collection System Summary_Table'!$I$8,\"Yes\",\"NO\")","v":"Yes"}]
[null,null,null,null,null,null,null,null,null,null,null,null,0,{"$error":"#VALUE!"},{"$error":"#VALUE!"},0,{"$error":"#VALUE!"},{"$error":"#VALUE!"},0,{"$error":"#VALUE!"},{"$f":"IF(S1457<='Collection System Summary_Table'!$I$8,\"Yes\",\"NO\")","v":"Yes"}]
[null,null,null,null,null,null,null,null,null,null,null,null,0,{"$error":"#VALUE!"},{"$error":"#VALUE!"},0,{"$error":"#VALUE!"},{"$error":"#VALUE!"},0,{"$error":"#VALUE!"},{"$f":"IF(S1458<='Collection System Summary_Table'!$I$8,\"Yes\",\"NO\")","v":"Yes"}]
[null,null,null,null,null,null,null,null,null,null,null,null,0,{"$error":"#VALUE!"},{"$error":"#VALUE!"},0,{"$error":"#VALUE!"},{"$error":"#VALUE!"},0,{"$error":"#VALUE!"},{"$f":"IF(S1459<='Collection System Summary_Table'!$I$8,\"Yes\",\"NO\")","v":"Yes"}]
[null,null,null,null,null,null,null,null,null,null,null,null,0,{"$error":"#VALUE!"},{"$error":"#VALUE!"},0,{"$error":"#VALUE!"},{"$error":"#VALUE!"},0,{"$error":"#VALUE!"},{"$f":"IF(S1460<='Collection System Summary_Table'!$I$8,\"Yes\",\"NO\")","v":"Yes"}]
[null,null,null,null,null,null,null,null,null,null,null,null,0,{"$error":"#VALUE!"},{"$error":"#VALUE!"},0,{"$error":"#VALUE!"},{"$error":"#VALUE!"},0,{"$error":"#VALUE!"},{"$f":"IF(S1461<='Collection System Summary_Table'!$I$8,\"Yes\",\"NO\")","v":"Yes"}]
[null,null,null,null,null,null,null,null,null,null,null,null,0,{"$error":"#VALUE!"},{"$error":"#VALUE!"},0,{"$error":"#VALUE!"},{"$error":"#VALUE!"},0,{"$error":"#VALUE!"},{"$f":"IF(S1462<='Collection System Summary_Table'!$I$8,\"Yes\",\"NO\")","v":"Yes"}]
[null,null,null,null,null,null,null,null,null,null,null,null,0,{"$error":"#VALUE!"},{"$error":"#VALUE!"},0,{"$error":"#VALUE!"},{"$error":"#VALUE!"},0,{"$error":"#VALUE!"},{"$f":"IF(S1463<='Collection System Summary_Table'!$I$8,\"Yes\",\"NO\")","v":"Yes"}]
[null,null,null,null,null,null,null,null,null,null,null,null,0,{"$error":"#VALUE!"},{"$error":"#VALUE!"},0,{"$error":"#VALUE!"},{"$error":"#VALUE!"},0,{"$error":"#VALUE!"},{"$f":"IF(S1464<='Collection System Summary_Table'!$I$8,\"Yes\",\"NO\")","v":"Yes"}]
[null,null,null,null,null,null,null,null,null,null,null,null,0,{"$error":"#VALUE!"},{"$error":"#VALUE!"},0,{"$error":"#VALUE!"},{"$error":"#VALUE!"},0,{"$error":"#VALUE!"},{"$f":"IF(S1465<='Collection System Summary_Table'!$I$8,\"Yes\",\"NO\")","v":"Yes"}]
[null,null,null,null,null,null,null,null,null,null,null,null,0,{"$error":"#VALUE!"},{"$error":"#VALUE!"},0,{"$error":"#VALUE!"},{"$error":"#VALUE!"},0,{"$error":"#VALUE!"},{"$f":"IF(S1466<='Collection System Summary_Table'!$I$8,\"Yes\",\"NO\")","v":"Yes"}]
[null,null,null,null,null,null,null,null,null,null,null,null,0,{"$error":"#VALUE!"},{"$error":"#VALUE!"},0,{"$error":"#VALUE!"},{"$error":"#VALUE!"},0,{"$error":"#VALUE!"},{"$f":"IF(S1467<='Collection System Summary_Table'!$I$8,\"Yes\",\"NO\")","v":"Yes"}]
[null,null,null,null,null,null,null,null,null,null,null,null,0,{"$error":"#VALUE!"},{"$error":"#VALUE!"},0,{"$error":"#VALUE!"},{"$error":"#VALUE!"},0,{"$error":"#VALUE!"},{"$f":"IF(S1468<='Collection System Summary_Table'!$I$8,\"Yes\",\"NO\")","v":"Yes"}]
[null,null,null,null,null,null,null,null,null,null,null,null,0,{"$error":"#VALUE!"},{"$error":"#VALUE!"},0,{"$error":"#VALUE!"},{"$error":"#VALUE!"},0,{"$error":"#VALUE!"},{"$f":"IF(S1469<='Collection System Summary_Table'!$I$8,\"Yes\",\"NO\")","v":"Yes"}]
[null,null,null,null,null,null,null,null,null,null,null,null,0,{"$error":"#VALUE!"},{"$error":"#VALUE!"},0,{"$error":"#VALUE!"},{"$error":"#VALUE!"},0,{"$error":"#VALUE!"},{"$f":"IF(S1470<='Collection System Summary_Table'!$I$8,\"Yes\",\"NO\")","v":"Yes"}]
[null,null,null,null,null,null,null,null,null,null,null,null,0,{"$error":"#VALUE!"},{"$error":"#VALUE!"},0,{"$error":"#VALUE!"},{"$error":"#VALUE!"},0,{"$error":"#VALUE!"},{"$f":"IF(S1471<='Collection System Summary_Table'!$I$8,\"Yes\",\"NO\")","v":"Yes"}]
[null,null,null,null,null,null,null,null,null,null,null,null,0,{"$error":"#VALUE!"},{"$error":"#VALUE!"},0,{"$error":"#VALUE!"},{"$error":"#VALUE!"},0,{"$error":"#VALUE!"},{"$f":"IF(S1472<='Collection System Summary_Table'!$I$8,\"Yes\",\"NO\")","v":"Yes"}]
[null,null,null,null,null,null,null,null,null,null,null,null,0,{"$error":"#VALUE!"},{"$error":"#VALUE!"},0,{"$error":"#VALUE!"},{"$error":"#VALUE!"},0,{"$error":"#VALUE!"},{"$f":"IF(S1473<='Collection System Summary_Table'!$I$8,\"Yes\",\"NO\")","v":"Yes"}]
[null,null,null,null,null,null,null,null,null,null,null,null,0,{"$error":"#VALUE!"},{"$error":"#VALUE!"},0,{"$error":"#VALUE!"},{"$error":"#VALUE!"},0,{"$error":"#VALUE!"},{"$f":"IF(S1474<='Collection System Summary_Table'!$I$8,\"Yes\",\"NO\")","v":"Yes"}]
[null,null,null,null,null,null,null,null,null,null,null,null,0,{"$f":"IF(P1475=0,I1475+N1474,0)","v":{"$error":"#VALUE!"}},{"$error":"#VALUE!"},0,{"$error":"#VALUE!"},{"$error":"#VALUE!"},0,{"$error":"#VALUE!"},{"$f":"IF(S1475<='Collection System Summary_Table'!$I$8,\"Yes\",\"NO\")","v":"Yes"}]
[null,null,null,null,null,null,null,null,null,null,null,null,0,{"$error":"#VALUE!"},{"$f":"IF(AND(Q1476=0,P1476=0),K1476+O1475,0)","v":{"$error":"#VALUE!"}},0,{"$f":"IF(AND(P1476=0,N1476<($B$4+$P$1)),J1476,0)","v":{"$error":"#VALUE!"}},{"$f":"IF(AND(P1476=0,Q1476=0,O1476<($B$5+$Q$1)),K1476,0)","v":{"$error":"#VALUE!"}},{"$f":"S1475+L1476","v":0},{"$f":"IF(OR(P1476>1,Q1476>1,R1476>1),\"YES\",\"NO\")","v":{"$error":"#VALUE!"}},{"$f":"IF(S1476<='Collection System Summary_Table'!$I$8,\"Yes\",\"NO\")","v":"Yes"}]
[null,null,null,null,null,null,null,null,null,null,null,null,{"$f":"M1476+I1477","v":0},{"$error":"#VALUE!"},{"$error":"#VALUE!"},{"$f":"IF(M1477<=$B$3,I1477,0)","v":0},{"$error":"#VALUE!"},{"$error":"#VALUE!"},0,{"$error":"#VALUE!"},{"$f":"IF(S1477<='Collection System Summary_Table'!$I$8,\"Yes\",\"NO\")","v":"Yes"}]
[null,null,null,null,null,null,null,null,null,null,null,null,0,{"$error":"#VALUE!"},{"$error":"#VALUE!"},0,{"$error":"#VALUE!"},{"$error":"#VALUE!"},0,{"$error":"#VALUE!"},{"$f":"IF(S1478<='Collection System Summary_Table'!$I$8,\"Yes\",\"NO\")","v":"Yes"}]
[null,null,null,null,null,null,null,null,null,null,null,null,0,{"$error":"#VALUE!"},{"$error":"#VALUE!"},0,{"$error":"#VALUE!"},{"$error":"#VALUE!"},0,{"$error":"#VALUE!"},{"$f":"IF(S1479<='Collection System Summary_Table'!$I$8,\"Yes\",\"NO\")","v":"Yes"}]
[null,null,null,null,null,null,null,null,null,null,null,null,0,{"$error":"#VALUE!"},{"$error":"#VALUE!"},0,{"$error":"#VALUE!"},{"$error":"#VALUE!"},0,{"$error":"#VALUE!"},{"$f":"IF(S1480<='Collection System Summary_Table'!$I$8,\"Yes\",\"NO\")","v":"Yes"}]
[null,null,null,null,null,null,null,null,null,null,null,null,0,{"$error":"#VALUE!"},{"$error":"#VALUE!"},0,{"$error":"#VALUE!"},{"$error":"#VALUE!"},0,{"$error":"#VALUE!"},{"$f":"IF(S1481<='Collection System Summary_Table'!$I$8,\"Yes\",\"NO\")","v":"Yes"}]
[null,null,null,null,null,null,null,null,null,null,null,null,0,{"$error":"#VALUE!"},{"$error":"#VALUE!"},0,{"$error":"#VALUE!"},{"$error":"#VALUE!"},0,{"$error":"#VALUE!"},{"$f":"IF(S1482<='Collection System Summary_Table'!$I$8,\"Yes\",\"NO\")","v":"Yes"}]
[null,null,null,null,null,null,null,null,null,null,null,null,0,{"$error":"#VALUE!"},{"$error":"#VALUE!"},0,{"$error":"#VALUE!"},{"$error":"#VALUE!"},0,{"$error":"#VALUE!"},{"$f":"IF(S1483<='Collection System Summary_Table'!$I$8,\"Yes\",\"NO\")","v":"Yes"}]
[null,null,null,null,null,null,null,null,null,null,null,null,0,{"$error":"#VALUE!"},{"$error":"#VALUE!"},0,{"$error":"#VALUE!"},{"$error":"#VALUE!"},0,{"$error":"#VALUE!"},{"$f":"IF(S1484<='Collection System Summary_Table'!$I$8,\"Yes\",\"NO\")","v":"Yes"}]
[null,null,null,null,null,null,null,null,null,null,null,null,0,{"$error":"#VALUE!"},{"$error":"#VALUE!"},0,{"$error":"#VALUE!"},{"$error":"#VALUE!"},0,{"$error":"#VALUE!"},{"$f":"IF(S1485<='Collection System Summary_Table'!$I$8,\"Yes\",\"NO\")","v":"Yes"}]
[null,null,null,null,null,null,null,null,null,null,null,null,0,{"$error":"#VALUE!"},{"$error":"#VALUE!"},0,{"$error":"#VALUE!"},{"$error":"#VALUE!"},0,{"$error":"#VALUE!"},{"$f":"IF(S1486<='Collection System Summary_Table'!$I$8,\"Yes\",\"NO\")","v":"Yes"}]
[null,null,null,null,null,null,null,null,null,null,null,null,0,{"$error":"#VALUE!"},{"$error":"#VALUE!"},0,{"$error":"#VALUE!"},{"$error":"#VALUE!"},0,{"$error":"#VALUE!"},{"$f":"IF(S1487<='Collection System Summary_Table'!$I$8,\"Yes\",\"NO\")","v":"Yes"}]
[null,null,null,null,null,null,null,null,null,null,null,null,0,{"$error":"#VALUE!"},{"$error":"#VALUE!"},0,{"$error":"#VALUE!"},{"$error":"#VALUE!"},0,{"$error":"#VALUE!"},{"$f":"IF(S1488<='Collection System Summary_Table'!$I$8,\"Yes\",\"NO\")","v":"Yes"}]
[null,null,null,null,null,null,null,null,null,null,null,null,0,{"$error":"#VALUE!"},{"$error":"#VALUE!"},0,{"$error":"#VALUE!"},{"$error":"#VALUE!"},0,{"$error":"#VALUE!"},{"$f":"IF(S1489<='Collection System Summary_Table'!$I$8,\"Yes\",\"NO\")","v":"Yes"}]
[null,null,null,null,null,null,null,null,null,null,null,null,0,{"$error":"#VALUE!"},{"$error":"#VALUE!"},0,{"$error":"#VALUE!"},{"$error":"#VALUE!"},0,{"$error":"#VALUE!"},{"$f":"IF(S1490<='Collection System Summary_Table'!$I$8,\"Yes\",\"NO\")","v":"Yes"}]
[null,null,null,null,null,null,null,null,null,null,null,null,0,{"$error":"#VALUE!"},{"$error":"#VALUE!"},0,{"$error":"#VALUE!"},{"$error":"#VALUE!"},0,{"$error":"#VALUE!"},{"$f":"IF(S1491<='Collection System Summary_Table'!$I$8,\"Yes\",\"NO\")","v":"Yes"}]
[null,null,null,null,null,null,null,null,null,null,null,null,0,{"$error":"#VALUE!"},{"$error":"#VALUE!"},0,{"$error":"#VALUE!"},{"$error":"#VALUE!"},0,{"$error":"#VALUE!"},{"$f":"IF(S1492<='Collection System Summary_Table'!$I$8,\"Yes\",\"NO\")","v":"Yes"}]
[null,null,null,null,null,null,null,null,null,null,null,null,0,{"$error":"#VALUE!"},{"$error":"#VALUE!"},0,{"$error":"#VALUE!"},{"$error":"#VALUE!"},0,{"$error":"#VALUE!"},{"$f":"IF(S1493<='Collection System Summary_Table'!$I$8,\"Yes\",\"NO\")","v":"Yes"}]
[null,null,null,null,null,null,null,null,null,null,null,null,0,{"$error":"#VALUE!"},{"$error":"#VALUE!"},0,{"$error":"#VALUE!"},{"$error":"#VALUE!"},0,{"$error":"#VALUE!"},{"$f":"IF(S1494<='Collection System Summary_Table'!$I$8,\"Yes\",\"NO\")","v":"Yes"}]
[null,null,null,null,null,null,null,null,null,null,null,null,0,{"$error":"#VALUE!"},{"$error":"#VALUE!"},0,{"$error":"#VALUE!"},{"$error":"#VALUE!"},0,{"$error":"#VALUE!"},{"$f":"IF(S1495<='Collection System Summary_Table'!$I$8,\"Yes\",\"NO\")","v":"Yes"}]
[null,null,null,null,null,null,null,null,null,null,null,null,0,{"$error":"#VALUE!"},{"$error":"#VALUE!"},0,{"$error":"#VALUE!"},{"$error":"#VALUE!"},0,{"$error":"#VALUE!"},{"$f":"IF(S1496<='Collection System Summary_Table'!$I$8,\"Yes\",\"NO\")","v":"Yes"}]
[null,null,null,null,null,null,null,null,null,null,null,null,0,{"$error":"#VALUE!"},{"$error":"#VALUE!"},0,{"$error":"#VALUE!"},{"$error":"#VALUE!"},0,{"$error":"#VALUE!"},{"$f":"IF(S1497<='Collection System Summary_Table'!$I$8,\"Yes\",\"NO\")","v":"Yes"}]
[null,null,null,null,null,null,null,null,null,null,null,null,0,{"$error":"#VALUE!"},{"$error":"#VALUE!"},0,{"$error":"#VALUE!"},{"$error":"#VALUE!"},0,{"$error":"#VALUE!"},{"$f":"IF(S1498<='Collection System Summary_Table'!$I$8,\"Yes\",\"NO\")","v":"Yes"}]
[null,null,null,null,null,null,null,null,null,null,null,null,0,{"$error":"#VALUE!"},{"$error":"#VALUE!"},0,{"$error":"#VALUE!"},{"$error":"#VALUE!"},0,{"$error":"#VALUE!"},{"$f":"IF(S1499<='Collection System Summary_Table'!$I$8,\"Yes\",\"NO\")","v":"Yes"}]
[null,null,null,null,null,null,null,null,null,null,null,null,0,{"$error":"#VALUE!"},{"$error":"#VALUE!"},0,{"$error":"#VALUE!"},{"$error":"#VALUE!"},0,{"$error":"#VALUE!"},{"$f":"IF(S1500<='Collection System Summary_Table'!$I$8,\"Yes\",\"NO\")","v":"Yes"}]
[null,null,null,null,null,null,null,null,null,null,null,null,0,{"$error":"#VALUE!"},{"$error":"#VALUE!"},0,{"$error":"#VALUE!"},{"$error":"#VALUE!"},0,{"$error":"#VALUE!"},{"$f":"IF(S1501<='Collection System Summary_Table'!$I$8,\"Yes\",\"NO\")","v":"Yes"}]
[null,null,null,null,null,null,null,null,null,null,null,null,0,{"$error":"#VALUE!"},{"$error":"#VALUE!"},0,{"$error":"#VALUE!"},{"$error":"#VALUE!"},0,{"$error":"#VALUE!"},{"$f":"IF(S1502<='Collection System Summary_Table'!$I$8,\"Yes\",\"NO\")","v":"Yes"}]
[null,null,null,null,null,null,null,null,null,null,null,null,0,{"$error":"#VALUE!"},{"$error":"#VALUE!"},0,{"$error":"#VALUE!"},{"$error":"#VALUE!"},0,{"$error":"#VALUE!"},{"$f":"IF(S1503<='Collection System Summary_Table'!$I$8,\"Yes\",\"NO\")","v":"Yes"}]
[null,null,null,null,null,null,null,null,null,null,null,null,0,{"$error":"#VALUE!"},{"$error":"#VALUE!"},0,{"$error":"#VALUE!"},{"$error":"#VALUE!"},0,{"$error":"#VALUE!"},{"$f":"IF(S1504<='Collection System Summary_Table'!$I$8,\"Yes\",\"NO\")","v":"Yes"}]
[null,null,null,null,null,null,null,null,null,null,null,null,0,{"$error":"#VALUE!"},{"$error":"#VALUE!"},0,{"$error":"#VALUE!"},{"$error":"#VALUE!"},0,{"$error":"#VALUE!"},{"$f":"IF(S1505<='Collection System Summary_Table'!$I$8,\"Yes\",\"NO\")","v":"Yes"}]
[null,null,null,null,null,null,null,null,null,null,null,null,0,{"$error":"#VALUE!"},{"$error":"#VALUE!"},0,{"$error":"#VALUE!"},{"$error":"#VALUE!"},0,{"$error":"#VALUE!"},{"$f":"IF(S1506<='Collection System Summary_Table'!$I$8,\"Yes\",\"NO\")","v":"Yes"}]
[null,null,null,null,null,null,null,null,null,null,null,null,0,{"$error":"#VALUE!"},{"$error":"#VALUE!"},0,{"$error":"#VALUE!"},{"$error":"#VALUE!"},0,{"$error":"#VALUE!"},{"$f":"IF(S1507<='Collection System Summary_Table'!$I$8,\"Yes\",\"NO\")","v":"Yes"}]
[null,null,null,null,null,null,null,null,null,null,null,null,0,{"$error":"#VALUE!"},{"$error":"#VALUE!"},0,{"$error":"#VALUE!"},{"$error":"#VALUE!"},0,{"$error":"#VALUE!"},{"$f":"IF(S1508<='Collection System Summary_Table'!$I$8,\"Yes\",\"NO\")","v":"Yes"}]
[null,null,null,null,null,null,null,null,null,null,null,null,0,{"$error":"#VALUE!"},{"$error":"#VALUE!"},0,{"$error":"#VALUE!"},{"$error":"#VALUE!"},0,{"$error":"#VALUE!"},{"$f":"IF(S1509<='Collection System Summary_Table'!$I$8,\"Yes\",\"NO\")","v":"Yes"}]
[null,null,null,null,null,null,null,null,null,null,null,null,0,{"$error":"#VALUE!"},{"$error":"#VALUE!"},0,{"$error":"#VALUE!"},{"$error":"#VALUE!"},0,{"$error":"#VALUE!"},{"$f":"IF(S1510<='Collection System Summary_Table'!$I$8,\"Yes\",\"NO\")","v":"Yes"}]
[null,null,null,null,null,null,null,null,null,null,null,null,0,{"$error":"#VALUE!"},{"$error":"#VALUE!"},0,{"$error":"#VALUE!"},{"$error":"#VALUE!"},0,{"$error":"#VALUE!"},{"$f":"IF(S1511<='Collection System Summary_Table'!$I$8,\"Yes\",\"NO\")","v":"Yes"}]
[null,null,null,null,null,null,null,null,null,null,null,null,0,{"$error":"#VALUE!"},{"$error":"#VALUE!"},0,{"$error":"#VALUE!"},{"$error":"#VALUE!"},0,{"$error":"#VALUE!"},{"$f":"IF(S1512<='Collection System Summary_Table'!$I$8,\"Yes\",\"NO\")","v":"Yes"}]
[null,null,null,null,null,null,null,null,null,null,null,null,0,{"$error":"#VALUE!"},{"$error":"#VALUE!"},0,{"$error":"#VALUE!"},{"$error":"#VALUE!"},0,{"$error":"#VALUE!"},{"$f":"IF(S1513<='Collection System Summary_Table'!$I$8,\"Yes\",\"NO\")","v":"Yes"}]
[null,null,null,null,null,null,null,null,null,null,null,null,0,{"$error":"#VALUE!"},{"$error":"#VALUE!"},0,{"$error":"#VALUE!"},{"$error":"#VALUE!"},0,{"$error":"#VALUE!"},{"$f":"IF(S1514<='Collection System Summary_Table'!$I$8,\"Yes\",\"NO\")","v":"Yes"}]
[null,null,null,null,null,null,null,null,null,null,null,null,0,{"$error":"#VALUE!"},{"$error":"#VALUE!"},0,{"$error":"#VALUE!"},{"$error":"#VALUE!"},0,{"$error":"#VALUE!"},{"$f":"IF(S1515<='Collection System Summary_Table'!$I$8,\"Yes\",\"NO\")","v":"Yes"}]
[null,null,null,null,null,null,null,null,null,null,null,null,0,{"$error":"#VALUE!"},{"$error":"#VALUE!"},0,{"$error":"#VALUE!"},{"$error":"#VALUE!"},0,{"$error":"#VALUE!"},{"$f":"IF(S1516<='Collection System Summary_Table'!$I$8,\"Yes\",\"NO\")","v":"Yes"}]
[null,null,null,null,null,null,null,null,null,null,null,null,0,{"$error":"#VALUE!"},{"$error":"#VALUE!"},0,{"$error":"#VALUE!"},{"$error":"#VALUE!"},0,{"$error":"#VALUE!"},{"$f":"IF(S1517<='Collection System Summary_Table'!$I$8,\"Yes\",\"NO\")","v":"Yes"}]
[null,null,null,null,null,null,null,null,null,null,null,null,0,{"$error":"#VALUE!"},{"$error":"#VALUE!"},0,{"$error":"#VALUE!"},{"$error":"#VALUE!"},0,{"$error":"#VALUE!"},{"$f":"IF(S1518<='Collection System Summary_Table'!$I$8,\"Yes\",\"NO\")","v":"Yes"}]
[null,null,null,null,null,null,null,null,null,null,null,null,0,{"$error":"#VALUE!"},{"$error":"#VALUE!"},0,{"$error":"#VALUE!"},{"$error":"#VALUE!"},0,{"$error":"#VALUE!"},{"$f":"IF(S1519<='Collection System Summary_Table'!$I$8,\"Yes\",\"NO\")","v":"Yes"}]
[null,null,null,null,null,null,null,null,null,null,null,null,0,{"$error":"#VALUE!"},{"$error":"#VALUE!"},0,{"$error":"#VALUE!"},{"$error":"#VALUE!"},0,{"$error":"#VALUE!"},{"$f":"IF(S1520<='Collection System Summary_Table'!$I$8,\"Yes\",\"NO\")","v":"Yes"}]
[null,null,null,null,null,null,null,null,null,null,null,null,0,{"$error":"#VALUE!"},{"$error":"#VALUE!"},0,{"$error":"#VALUE!"},{"$error":"#VALUE!"},0,{"$error":"#VALUE!"},{"$f":"IF(S1521<='Collection System Summary_Table'!$I$8,\"Yes\",\"NO\")","v":"Yes"}]
[null,null,null,null,null,null,null,null,null,null,null,null,0,{"$error":"#VALUE!"},{"$error":"#VALUE!"},0,{"$error":"#VALUE!"},{"$error":"#VALUE!"},0,{"$error":"#VALUE!"},{"$f":"IF(S1522<='Collection System Summary_Table'!$I$8,\"Yes\",\"NO\")","v":"Yes"}]
[null,null,null,null,null,null,null,null,null,null,null,null,0,{"$error":"#VALUE!"},{"$error":"#VALUE!"},0,{"$error":"#VALUE!"},{"$error":"#VALUE!"},0,{"$error":"#VALUE!"},{"$f":"IF(S1523<='Collection System Summary_Table'!$I$8,\"Yes\",\"NO\")","v":"Yes"}]
[null,null,null,null,null,null,null,null,null,null,null,null,0,{"$error":"#VALUE!"},{"$error":"#VALUE!"},0,{"$error":"#VALUE!"},{"$error":"#VALUE!"},0,{"$error":"#VALUE!"},{"$f":"IF(S1524<='Collection System Summary_Table'!$I$8,\"Yes\",\"NO\")","v":"Yes"}]
[null,null,null,null,null,null,null,null,null,null,null,null,0,{"$error":"#VALUE!"},{"$error":"#VALUE!"},0,{"$error":"#VALUE!"},{"$error":"#VALUE!"},0,{"$error":"#VALUE!"},{"$f":"IF(S1525<='Collection System Summary_Table'!$I$8,\"Yes\",\"NO\")","v":"Yes"}]
[null,null,null,null,null,null,null,null,null,null,null,null,0,{"$error":"#VALUE!"},{"$error":"#VALUE!"},0,{"$error":"#VALUE!"},{"$error":"#VALUE!"},0,{"$error":"#VALUE!"},{"$f":"IF(S1526<='Collection System Summary_Table'!$I$8,\"Yes\",\"NO\")","v":"Yes"}]
[null,null,null,null,null,null,null,null,null,null,null,null,0,{"$error":"#VALUE!"},{"$error":"#VALUE!"},0,{"$error":"#VALUE!"},{"$error":"#VALUE!"},0,{"$error":"#VALUE!"},{"$f":"IF(S1527<='Collection System Summary_Table'!$I$8,\"Yes\",\"NO\")","v":"Yes"}]
[null,null,null,null,null,null,null,null,null,null,null,null,0,{"$error":"#VALUE!"},{"$error":"#VALUE!"},0,{"$error":"#VALUE!"},{"$error":"#VALUE!"},0,{"$error":"#VALUE!"},{"$f":"IF(S1528<='Collection System Summary_Table'!$I$8,\"Yes\",\"NO\")","v":"Yes"}]
[null,null,null,null,null,null,null,null,null,null,null,null,0,{"$error":"#VALUE!"},{"$error":"#VALUE!"},0,{"$error":"#VALUE!"},{"$error":"#VALUE!"},0,{"$error":"#VALUE!"},{"$f":"IF(S1529<='Collection System Summary_Table'!$I$8,\"Yes\",\"NO\")","v":"Yes"}]
[null,null,null,null,null,null,null,null,null,null,null,null,0,{"$error":"#VALUE!"},{"$error":"#VALUE!"},0,{"$error":"#VALUE!"},{"$error":"#VALUE!"},0,{"$error":"#VALUE!"},{"$f":"IF(S1530<='Collection System Summary_Table'!$I$8,\"Yes\",\"NO\")","v":"Yes"}]
[null,null,null,null,null,null,null,null,null,null,null,null,0,{"$error":"#VALUE!"},{"$error":"#VALUE!"},0,{"$error":"#VALUE!"},{"$error":"#VALUE!"},0,{"$error":"#VALUE!"},{"$f":"IF(S1531<='Collection System Summary_Table'!$I$8,\"Yes\",\"NO\")","v":"Yes"}]
[null,null,null,null,null,null,null,null,null,null,null,null,0,{"$error":"#VALUE!"},{"$error":"#VALUE!"},0,{"$error":"#VALUE!"},{"$error":"#VALUE!"},0,{"$error":"#VALUE!"},{"$f":"IF(S1532<='Collection System Summary_Table'!$I$8,\"Yes\",\"NO\")","v":"Yes"}]
[null,null,null,null,null,null,null,null,null,null,null,null,0,{"$error":"#VALUE!"},{"$error":"#VALUE!"},0,{"$error":"#VALUE!"},{"$error":"#VALUE!"},0,{"$error":"#VALUE!"},{"$f":"IF(S1533<='Collection System Summary_Table'!$I$8,\"Yes\",\"NO\")","v":"Yes"}]
[null,null,null,null,null,null,null,null,null,null,null,null,0,{"$error":"#VALUE!"},{"$error":"#VALUE!"},0,{"$error":"#VALUE!"},{"$error":"#VALUE!"},0,{"$error":"#VALUE!"},{"$f":"IF(S1534<='Collection System Summary_Table'!$I$8,\"Yes\",\"NO\")","v":"Yes"}]
[null,null,null,null,null,null,null,null,null,null,null,null,0,{"$error":"#VALUE!"},{"$error":"#VALUE!"},0,{"$error":"#VALUE!"},{"$error":"#VALUE!"},0,{"$error":"#VALUE!"},{"$f":"IF(S1535<='Collection System Summary_Table'!$I$8,\"Yes\",\"NO\")","v":"Yes"}]
[null,null,null,null,null,null,null,null,null,null,null,null,0,{"$error":"#VALUE!"},{"$error":"#VALUE!"},0,{"$error":"#VALUE!"},{"$error":"#VALUE!"},0,{"$error":"#VALUE!"},{"$f":"IF(S1536<='Collection System Summary_Table'!$I$8,\"Yes\",\"NO\")","v":"Yes"}]
[null,null,null,null,null,null,null,null,null,null,null,null,0,{"$error":"#VALUE!"},{"$error":"#VALUE!"},0,{"$error":"#VALUE!"},{"$error":"#VALUE!"},0,{"$error":"#VALUE!"},{"$f":"IF(S1537<='Collection System Summary_Table'!$I$8,\"Yes\",\"NO\")","v":"Yes"}]
[null,null,null,null,null,null,null,null,null,null,null,null,0,{"$error":"#VALUE!"},{"$error":"#VALUE!"},0,{"$error":"#VALUE!"},{"$error":"#VALUE!"},0,{"$error":"#VALUE!"},{"$f":"IF(S1538<='Collection System Summary_Table'!$I$8,\"Yes\",\"NO\")","v":"Yes"}]
[null,null,null,null,null,null,null,null,null,null,null,null,0,{"$f":"IF(P1539=0,I1539+N1538,0)","v":{"$error":"#VALUE!"}},{"$error":"#VALUE!"},0,{"$error":"#VALUE!"},{"$error":"#VALUE!"},0,{"$error":"#VALUE!"},{"$f":"IF(S1539<='Collection System Summary_Table'!$I$8,\"Yes\",\"NO\")","v":"Yes"}]
[null,null,null,null,null,null,null,null,null,null,null,null,0,{"$error":"#VALUE!"},{"$f":"IF(AND(Q1540=0,P1540=0),K1540+O1539,0)","v":{"$error":"#VALUE!"}},0,{"$f":"IF(AND(P1540=0,N1540<($B$4+$P$1)),J1540,0)","v":{"$error":"#VALUE!"}},{"$f":"IF(AND(P1540=0,Q1540=0,O1540<($B$5+$Q$1)),K1540,0)","v":{"$error":"#VALUE!"}},{"$f":"S1539+L1540","v":0},{"$f":"IF(OR(P1540>1,Q1540>1,R1540>1),\"YES\",\"NO\")","v":{"$error":"#VALUE!"}},{"$f":"IF(S1540<='Collection System Summary_Table'!$I$8,\"Yes\",\"NO\")","v":"Yes"}]
[null,null,null,null,null,null,null,null,null,null,null,null,{"$f":"M1540+I1541","v":0},{"$error":"#VALUE!"},{"$error":"#VALUE!"},{"$f":"IF(M1541<=$B$3,I1541,0)","v":0},{"$error":"#VALUE!"},{"$error":"#VALUE!"},0,{"$error":"#VALUE!"},{"$f":"IF(S1541<='Collection System Summary_Table'!$I$8,\"Yes\",\"NO\")","v":"Yes"}]
[null,null,null,null,null,null,null,null,null,null,null,null,0,{"$error":"#VALUE!"},{"$error":"#VALUE!"},0,{"$error":"#VALUE!"},{"$error":"#VALUE!"},0,{"$error":"#VALUE!"},{"$f":"IF(S1542<='Collection System Summary_Table'!$I$8,\"Yes\",\"NO\")","v":"Yes"}]
[null,null,null,null,null,null,null,null,null,null,null,null,0,{"$error":"#VALUE!"},{"$error":"#VALUE!"},0,{"$error":"#VALUE!"},{"$error":"#VALUE!"},0,{"$error":"#VALUE!"},{"$f":"IF(S1543<='Collection System Summary_Table'!$I$8,\"Yes\",\"NO\")","v":"Yes"}]
[null,null,null,null,null,null,null,null,null,null,null,null,0,{"$error":"#VALUE!"},{"$error":"#VALUE!"},0,{"$error":"#VALUE!"},{"$error":"#VALUE!"},0,{"$error":"#VALUE!"},{"$f":"IF(S1544<='Collection System Summary_Table'!$I$8,\"Yes\",\"NO\")","v":"Yes"}]
[null,null,null,null,null,null,null,null,null,null,null,null,0,{"$error":"#VALUE!"},{"$error":"#VALUE!"},0,{"$error":"#VALUE!"},{"$error":"#VALUE!"},0,{"$error":"#VALUE!"},{"$f":"IF(S1545<='Collection System Summary_Table'!$I$8,\"Yes\",\"NO\")","v":"Yes"}]
[null,null,null,null,null,null,null,null,null,null,null,null,0,{"$error":"#VALUE!"},{"$error":"#VALUE!"},0,{"$error":"#VALUE!"},{"$error":"#VALUE!"},0,{"$error":"#VALUE!"},{"$f":"IF(S1546<='Collection System Summary_Table'!$I$8,\"Yes\",\"NO\")","v":"Yes"}]
[null,null,null,null,null,null,null,null,null,null,null,null,0,{"$error":"#VALUE!"},{"$error":"#VALUE!"},0,{"$error":"#VALUE!"},{"$error":"#VALUE!"},0,{"$error":"#VALUE!"},{"$f":"IF(S1547<='Collection System Summary_Table'!$I$8,\"Yes\",\"NO\")","v":"Yes"}]
[null,null,null,null,null,null,null,null,null,null,null,null,0,{"$error":"#VALUE!"},{"$error":"#VALUE!"},0,{"$error":"#VALUE!"},{"$error":"#VALUE!"},0,{"$error":"#VALUE!"},{"$f":"IF(S1548<='Collection System Summary_Table'!$I$8,\"Yes\",\"NO\")","v":"Yes"}]
[null,null,null,null,null,null,null,null,null,null,null,null,0,{"$error":"#VALUE!"},{"$error":"#VALUE!"},0,{"$error":"#VALUE!"},{"$error":"#VALUE!"},0,{"$error":"#VALUE!"},{"$f":"IF(S1549<='Collection System Summary_Table'!$I$8,\"Yes\",\"NO\")","v":"Yes"}]
[null,null,null,null,null,null,null,null,null,null,null,null,0,{"$error":"#VALUE!"},{"$error":"#VALUE!"},0,{"$error":"#VALUE!"},{"$error":"#VALUE!"},0,{"$error":"#VALUE!"},{"$f":"IF(S1550<='Collection System Summary_Table'!$I$8,\"Yes\",\"NO\")","v":"Yes"}]
[null,null,null,null,null,null,null,null,null,null,null,null,0,{"$error":"#VALUE!"},{"$error":"#VALUE!"},0,{"$error":"#VALUE!"},{"$error":"#VALUE!"},0,{"$error":"#VALUE!"},{"$f":"IF(S1551<='Collection System Summary_Table'!$I$8,\"Yes\",\"NO\")","v":"Yes"}]
[null,null,null,null,null,null,null,null,null,null,null,null,0,{"$error":"#VALUE!"},{"$error":"#VALUE!"},0,{"$error":"#VALUE!"},{"$error":"#VALUE!"},0,{"$error":"#VALUE!"},{"$f":"IF(S1552<='Collection System Summary_Table'!$I$8,\"Yes\",\"NO\")","v":"Yes"}]
[null,null,null,null,null,null,null,null,null,null,null,null,0,{"$error":"#VALUE!"},{"$error":"#VALUE!"},0,{"$error":"#VALUE!"},{"$error":"#VALUE!"},0,{"$error":"#VALUE!"},{"$f":"IF(S1553<='Collection System Summary_Table'!$I$8,\"Yes\",\"NO\")","v":"Yes"}]
[null,null,null,null,null,null,null,null,null,null,null,null,0,{"$error":"#VALUE!"},{"$error":"#VALUE!"},0,{"$error":"#VALUE!"},{"$error":"#VALUE!"},0,{"$error":"#VALUE!"},{"$f":"IF(S1554<='Collection System Summary_Table'!$I$8,\"Yes\",\"NO\")","v":"Yes"}]
[null,null,null,null,null,null,null,null,null,null,null,null,0,{"$error":"#VALUE!"},{"$error":"#VALUE!"},0,{"$error":"#VALUE!"},{"$error":"#VALUE!"},0,{"$error":"#VALUE!"},{"$f":"IF(S1555<='Collection System Summary_Table'!$I$8,\"Yes\",\"NO\")","v":"Yes"}]
[null,null,null,null,null,null,null,null,null,null,null,null,0,{"$error":"#VALUE!"},{"$error":"#VALUE!"},0,{"$error":"#VALUE!"},{"$error":"#VALUE!"},0,{"$error":"#VALUE!"},{"$f":"IF(S1556<='Collection System Summary_Table'!$I$8,\"Yes\",\"NO\")","v":"Yes"}]
[null,null,null,null,null,null,null,null,null,null,null,null,0,{"$error":"#VALUE!"},{"$error":"#VALUE!"},0,{"$error":"#VALUE!"},{"$error":"#VALUE!"},0,{"$error":"#VALUE!"},{"$f":"IF(S1557<='Collection System Summary_Table'!$I$8,\"Yes\",\"NO\")","v":"Yes"}]
[null,null,null,null,null,null,null,null,null,null,null,null,0,{"$error":"#VALUE!"},{"$error":"#VALUE!"},0,{"$error":"#VALUE!"},{"$error":"#VALUE!"},0,{"$error":"#VALUE!"},{"$f":"IF(S1558<='Collection System Summary_Table'!$I$8,\"Yes\",\"NO\")","v":"Yes"}]
[null,null,null,null,null,null,null,null,null,null,null,null,0,{"$error":"#VALUE!"},{"$error":"#VALUE!"},0,{"$error":"#VALUE!"},{"$error":"#VALUE!"},0,{"$error":"#VALUE!"},{"$f":"IF(S1559<='Collection System Summary_Table'!$I$8,\"Yes\",\"NO\")","v":"Yes"}]
[null,null,null,null,null,null,null,null,null,null,null,null,0,{"$error":"#VALUE!"},{"$error":"#VALUE!"},0,{"$error":"#VALUE!"},{"$error":"#VALUE!"},0,{"$error":"#VALUE!"},{"$f":"IF(S1560<='Collection System Summary_Table'!$I$8,\"Yes\",\"NO\")","v":"Yes"}]
[null,null,null,null,null,null,null,null,null,null,null,null,0,{"$error":"#VALUE!"},{"$error":"#VALUE!"},0,{"$error":"#VALUE!"},{"$error":"#VALUE!"},0,{"$error":"#VALUE!"},{"$f":"IF(S1561<='Collection System Summary_Table'!$I$8,\"Yes\",\"NO\")","v":"Yes"}]
[null,null,null,null,null,null,null,null,null,null,null,null,0,{"$error":"#VALUE!"},{"$error":"#VALUE!"},0,{"$error":"#VALUE!"},{"$error":"#VALUE!"},0,{"$error":"#VALUE!"},{"$f":"IF(S1562<='Collection System Summary_Table'!$I$8,\"Yes\",\"NO\")","v":"Yes"}]
[null,null,null,null,null,null,null,null,null,null,null,null,0,{"$error":"#VALUE!"},{"$error":"#VALUE!"},0,{"$error":"#VALUE!"},{"$error":"#VALUE!"},0,{"$error":"#VALUE!"},{"$f":"IF(S1563<='Collection System Summary_Table'!$I$8,\"Yes\",\"NO\")","v":"Yes"}]
[null,null,null,null,null,null,null,null,null,null,null,null,0,{"$error":"#VALUE!"},{"$error":"#VALUE!"},0,{"$error":"#VALUE!"},{"$error":"#VALUE!"},0,{"$error":"#VALUE!"},{"$f":"IF(S1564<='Collection System Summary_Table'!$I$8,\"Yes\",\"NO\")","v":"Yes"}]
[null,null,null,null,null,null,null,null,null,null,null,null,0,{"$error":"#VALUE!"},{"$error":"#VALUE!"},0,{"$error":"#VALUE!"},{"$error":"#VALUE!"},0,{"$error":"#VALUE!"},{"$f":"IF(S1565<='Collection System Summary_Table'!$I$8,\"Yes\",\"NO\")","v":"Yes"}]
[null,null,null,null,null,null,null,null,null,null,null,null,0,{"$error":"#VALUE!"},{"$error":"#VALUE!"},0,{"$error":"#VALUE!"},{"$error":"#VALUE!"},0,{"$error":"#VALUE!"},{"$f":"IF(S1566<='Collection System Summary_Table'!$I$8,\"Yes\",\"NO\")","v":"Yes"}]
[null,null,null,null,null,null,null,null,null,null,null,null,0,{"$error":"#VALUE!"},{"$error":"#VALUE!"},0,{"$error":"#VALUE!"},{"$error":"#VALUE!"},0,{"$error":"#VALUE!"},{"$f":"IF(S1567<='Collection System Summary_Table'!$I$8,\"Yes\",\"NO\")","v":"Yes"}]
[null,null,null,null,null,null,null,null,null,null,null,null,0,{"$error":"#VALUE!"},{"$error":"#VALUE!"},0,{"$error":"#VALUE!"},{"$error":"#VALUE!"},0,{"$error":"#VALUE!"},{"$f":"IF(S1568<='Collection System Summary_Table'!$I$8,\"Yes\",\"NO\")","v":"Yes"}]
[null,null,null,null,null,null,null,null,null,null,null,null,0,{"$error":"#VALUE!"},{"$error":"#VALUE!"},0,{"$error":"#VALUE!"},{"$error":"#VALUE!"},0,{"$error":"#VALUE!"},{"$f":"IF(S1569<='Collection System Summary_Table'!$I$8,\"Yes\",\"NO\")","v":"Yes"}]
[null,null,null,null,null,null,null,null,null,null,null,null,0,{"$error":"#VALUE!"},{"$error":"#VALUE!"},0,{"$error":"#VALUE!"},{"$error":"#VALUE!"},0,{"$error":"#VALUE!"},{"$f":"IF(S1570<='Collection System Summary_Table'!$I$8,\"Yes\",\"NO\")","v":"Yes"}]
[null,null,null,null,null,null,null,null,null,null,null,null,0,{"$error":"#VALUE!"},{"$error":"#VALUE!"},0,{"$error":"#VALUE!"},{"$error":"#VALUE!"},0,{"$error":"#VALUE!"},{"$f":"IF(S1571<='Collection System Summary_Table'!$I$8,\"Yes\",\"NO\")","v":"Yes"}]
[null,null,null,null,null,null,null,null,null,null,null,null,0,{"$error":"#VALUE!"},{"$error":"#VALUE!"},0,{"$error":"#VALUE!"},{"$error":"#VALUE!"},0,{"$error":"#VALUE!"},{"$f":"IF(S1572<='Collection System Summary_Table'!$I$8,\"Yes\",\"NO\")","v":"Yes"}]
[null,null,null,null,null,null,null,null,null,null,null,null,0,{"$error":"#VALUE!"},{"$error":"#VALUE!"},0,{"$error":"#VALUE!"},{"$error":"#VALUE!"},0,{"$error":"#VALUE!"},{"$f":"IF(S1573<='Collection System Summary_Table'!$I$8,\"Yes\",\"NO\")","v":"Yes"}]
[null,null,null,null,null,null,null,null,null,null,null,null,0,{"$error":"#VALUE!"},{"$error":"#VALUE!"},0,{"$error":"#VALUE!"},{"$error":"#VALUE!"},0,{"$error":"#VALUE!"},{"$f":"IF(S1574<='Collection System Summary_Table'!$I$8,\"Yes\",\"NO\")","v":"Yes"}]
[null,null,null,null,null,null,null,null,null,null,null,null,0,{"$error":"#VALUE!"},{"$error":"#VALUE!"},0,{"$error":"#VALUE!"},{"$error":"#VALUE!"},0,{"$error":"#VALUE!"},{"$f":"IF(S1575<='Collection System Summary_Table'!$I$8,\"Yes\",\"NO\")","v":"Yes"}]
[null,null,null,null,null,null,null,null,null,null,null,null,0,{"$error":"#VALUE!"},{"$error":"#VALUE!"},0,{"$error":"#VALUE!"},{"$error":"#VALUE!"},0,{"$error":"#VALUE!"},{"$f":"IF(S1576<='Collection System Summary_Table'!$I$8,\"Yes\",\"NO\")","v":"Yes"}]
[null,null,null,null,null,null,null,null,null,null,null,null,0,{"$error":"#VALUE!"},{"$error":"#VALUE!"},0,{"$error":"#VALUE!"},{"$error":"#VALUE!"},0,{"$error":"#VALUE!"},{"$f":"IF(S1577<='Collection System Summary_Table'!$I$8,\"Yes\",\"NO\")","v":"Yes"}]
[null,null,null,null,null,null,null,null,null,null,null,null,0,{"$error":"#VALUE!"},{"$error":"#VALUE!"},0,{"$error":"#VALUE!"},{"$error":"#VALUE!"},0,{"$error":"#VALUE!"},{"$f":"IF(S1578<='Collection System Summary_Table'!$I$8,\"Yes\",\"NO\")","v":"Yes"}]
[null,null,null,null,null,null,null,null,null,null,null,null,0,{"$error":"#VALUE!"},{"$error":"#VALUE!"},0,{"$error":"#VALUE!"},{"$error":"#VALUE!"},0,{"$error":"#VALUE!"},{"$f":"IF(S1579<='Collection System Summary_Table'!$I$8,\"Yes\",\"NO\")","v":"Yes"}]
[null,null,null,null,null,null,null,null,null,null,null,null,0,{"$error":"#VALUE!"},{"$error":"#VALUE!"},0,{"$error":"#VALUE!"},{"$error":"#VALUE!"},0,{"$error":"#VALUE!"},{"$f":"IF(S1580<='Collection System Summary_Table'!$I$8,\"Yes\",\"NO\")","v":"Yes"}]
[null,null,null,null,null,null,null,null,null,null,null,null,0,{"$error":"#VALUE!"},{"$error":"#VALUE!"},0,{"$error":"#VALUE!"},{"$error":"#VALUE!"},0,{"$error":"#VALUE!"},{"$f":"IF(S1581<='Collection System Summary_Table'!$I$8,\"Yes\",\"NO\")","v":"Yes"}]
[null,null,null,null,null,null,null,null,null,null,null,null,0,{"$error":"#VALUE!"},{"$error":"#VALUE!"},0,{"$error":"#VALUE!"},{"$error":"#VALUE!"},0,{"$error":"#VALUE!"},{"$f":"IF(S1582<='Collection System Summary_Table'!$I$8,\"Yes\",\"NO\")","v":"Yes"}]
[null,null,null,null,null,null,null,null,null,null,null,null,0,{"$error":"#VALUE!"},{"$error":"#VALUE!"},0,{"$error":"#VALUE!"},{"$error":"#VALUE!"},0,{"$error":"#VALUE!"},{"$f":"IF(S1583<='Collection System Summary_Table'!$I$8,\"Yes\",\"NO\")","v":"Yes"}]
[null,null,null,null,null,null,null,null,null,null,null,null,0,{"$error":"#VALUE!"},{"$error":"#VALUE!"},0,{"$error":"#VALUE!"},{"$error":"#VALUE!"},0,{"$error":"#VALUE!"},{"$f":"IF(S1584<='Collection System Summary_Table'!$I$8,\"Yes\",\"NO\")","v":"Yes"}]
[null,null,null,null,null,null,null,null,null,null,null,null,0,{"$error":"#VALUE!"},{"$error":"#VALUE!"},0,{"$error":"#VALUE!"},{"$error":"#VALUE!"},0,{"$error":"#VALUE!"},{"$f":"IF(S1585<='Collection System Summary_Table'!$I$8,\"Yes\",\"NO\")","v":"Yes"}]
[null,null,null,null,null,null,null,null,null,null,null,null,0,{"$error":"#VALUE!"},{"$error":"#VALUE!"},0,{"$error":"#VALUE!"},{"$error":"#VALUE!"},0,{"$error":"#VALUE!"},{"$f":"IF(S1586<='Collection System Summary_Table'!$I$8,\"Yes\",\"NO\")","v":"Yes"}]
[null,null,null,null,null,null,null,null,null,null,null,null,0,{"$error":"#VALUE!"},{"$error":"#VALUE!"},0,{"$error":"#VALUE!"},{"$error":"#VALUE!"},0,{"$error":"#VALUE!"},{"$f":"IF(S1587<='Collection System Summary_Table'!$I$8,\"Yes\",\"NO\")","v":"Yes"}]
[null,null,null,null,null,null,null,null,null,null,null,null,0,{"$error":"#VALUE!"},{"$error":"#VALUE!"},0,{"$error":"#VALUE!"},{"$error":"#VALUE!"},0,{"$error":"#VALUE!"},{"$f":"IF(S1588<='Collection System Summary_Table'!$I$8,\"Yes\",\"NO\")","v":"Yes"}]
[null,null,null,null,null,null,null,null,null,null,null,null,0,{"$error":"#VALUE!"},{"$error":"#VALUE!"},0,{"$error":"#VALUE!"},{"$error":"#VALUE!"},0,{"$error":"#VALUE!"},{"$f":"IF(S1589<='Collection System Summary_Table'!$I$8,\"Yes\",\"NO\")","v":"Yes"}]
[null,null,null,null,null,null,null,null,null,null,null,null,0,{"$error":"#VALUE!"},{"$error":"#VALUE!"},0,{"$error":"#VALUE!"},{"$error":"#VALUE!"},0,{"$error":"#VALUE!"},{"$f":"IF(S1590<='Collection System Summary_Table'!$I$8,\"Yes\",\"NO\")","v":"Yes"}]
[null,null,null,null,null,null,null,null,null,null,null,null,0,{"$error":"#VALUE!"},{"$error":"#VALUE!"},0,{"$error":"#VALUE!"},{"$error":"#VALUE!"},0,{"$error":"#VALUE!"},{"$f":"IF(S1591<='Collection System Summary_Table'!$I$8,\"Yes\",\"NO\")","v":"Yes"}]
[null,null,null,null,null,null,null,null,null,null,null,null,0,{"$error":"#VALUE!"},{"$error":"#VALUE!"},0,{"$error":"#VALUE!"},{"$error":"#VALUE!"},0,{"$error":"#VALUE!"},{"$f":"IF(S1592<='Collection System Summary_Table'!$I$8,\"Yes\",\"NO\")","v":"Yes"}]
[null,null,null,null,null,null,null,null,null,null,null,null,0,{"$error":"#VALUE!"},{"$error":"#VALUE!"},0,{"$error":"#VALUE!"},{"$error":"#VALUE!"},0,{"$error":"#VALUE!"},{"$f":"IF(S1593<='Collection System Summary_Table'!$I$8,\"Yes\",\"NO\")","v":"Yes"}]
[null,null,null,null,null,null,null,null,null,null,null,null,0,{"$error":"#VALUE!"},{"$error":"#VALUE!"},0,{"$error":"#VALUE!"},{"$error":"#VALUE!"},0,{"$error":"#VALUE!"},{"$f":"IF(S1594<='Collection System Summary_Table'!$I$8,\"Yes\",\"NO\")","v":"Yes"}]
[null,null,null,null,null,null,null,null,null,null,null,null,0,{"$error":"#VALUE!"},{"$error":"#VALUE!"},0,{"$error":"#VALUE!"},{"$error":"#VALUE!"},0,{"$error":"#VALUE!"},{"$f":"IF(S1595<='Collection System Summary_Table'!$I$8,\"Yes\",\"NO\")","v":"Yes"}]
[null,null,null,null,null,null,null,null,null,null,null,null,0,{"$error":"#VALUE!"},{"$error":"#VALUE!"},0,{"$error":"#VALUE!"},{"$error":"#VALUE!"},0,{"$error":"#VALUE!"},{"$f":"IF(S1596<='Collection System Summary_Table'!$I$8,\"Yes\",\"NO\")","v":"Yes"}]
[null,null,null,null,null,null,null,null,null,null,null,null,0,{"$error":"#VALUE!"},{"$error":"#VALUE!"},0,{"$error":"#VALUE!"},{"$error":"#VALUE!"},0,{"$error":"#VALUE!"},{"$f":"IF(S1597<='Collection System Summary_Table'!$I$8,\"Yes\",\"NO\")","v":"Yes"}]
[null,null,null,null,null,null,null,null,null,null,null,null,0,{"$error":"#VALUE!"},{"$error":"#VALUE!"},0,{"$error":"#VALUE!"},{"$error":"#VALUE!"},0,{"$error":"#VALUE!"},{"$f":"IF(S1598<='Collection System Summary_Table'!$I$8,\"Yes\",\"NO\")","v":"Yes"}]
[null,null,null,null,null,null,null,null,null,null,null,null,0,{"$error":"#VALUE!"},{"$error":"#VALUE!"},0,{"$error":"#VALUE!"},{"$error":"#VALUE!"},0,{"$error":"#VALUE!"},{"$f":"IF(S1599<='Collection System Summary_Table'!$I$8,\"Yes\",\"NO\")","v":"Yes"}]
[null,null,null,null,null,null,null,null,null,null,null,null,0,{"$error":"#VALUE!"},{"$error":"#VALUE!"},0,{"$error":"#VALUE!"},{"$error":"#VALUE!"},0,{"$error":"#VALUE!"},{"$f":"IF(S1600<='Collection System Summary_Table'!$I$8,\"Yes\",\"NO\")","v":"Yes"}]
[null,null,null,null,null,null,null,null,null,null,null,null,0,{"$error":"#VALUE!"},{"$error":"#VALUE!"},0,{"$error":"#VALUE!"},{"$error":"#VALUE!"},0,{"$error":"#VALUE!"},{"$f":"IF(S1601<='Collection System Summary_Table'!$I$8,\"Yes\",\"NO\")","v":"Yes"}]
[null,null,null,null,null,null,null,null,null,null,null,null,0,{"$error":"#VALUE!"},{"$error":"#VALUE!"},0,{"$error":"#VALUE!"},{"$error":"#VALUE!"},0,{"$error":"#VALUE!"},{"$f":"IF(S1602<='Collection System Summary_Table'!$I$8,\"Yes\",\"NO\")","v":"Yes"}]
[null,null,null,null,null,null,null,null,null,null,null,null,0,{"$f":"IF(P1603=0,I1603+N1602,0)","v":{"$error":"#VALUE!"}},{"$error":"#VALUE!"},0,{"$error":"#VALUE!"},{"$error":"#VALUE!"},0,{"$error":"#VALUE!"},{"$f":"IF(S1603<='Collection System Summary_Table'!$I$8,\"Yes\",\"NO\")","v":"Yes"}]
[null,null,null,null,null,null,null,null,null,null,null,null,0,{"$error":"#VALUE!"},{"$f":"IF(AND(Q1604=0,P1604=0),K1604+O1603,0)","v":{"$error":"#VALUE!"}},0,{"$f":"IF(AND(P1604=0,N1604<($B$4+$P$1)),J1604,0)","v":{"$error":"#VALUE!"}},{"$f":"IF(AND(P1604=0,Q1604=0,O1604<($B$5+$Q$1)),K1604,0)","v":{"$error":"#VALUE!"}},{"$f":"S1603+L1604","v":0},{"$f":"IF(OR(P1604>1,Q1604>1,R1604>1),\"YES\",\"NO\")","v":{"$error":"#VALUE!"}},{"$f":"IF(S1604<='Collection System Summary_Table'!$I$8,\"Yes\",\"NO\")","v":"Yes"}]
[null,null,null,null,null,null,null,null,null,null,null,null,{"$f":"M1604+I1605","v":0},{"$error":"#VALUE!"},{"$error":"#VALUE!"},{"$f":"IF(M1605<=$B$3,I1605,0)","v":0},{"$error":"#VALUE!"},{"$error":"#VALUE!"},0,{"$error":"#VALUE!"},{"$f":"IF(S1605<='Collection System Summary_Table'!$I$8,\"Yes\",\"NO\")","v":"Yes"}]
[null,null,null,null,null,null,null,null,null,null,null,null,0,{"$error":"#VALUE!"},{"$error":"#VALUE!"},0,{"$error":"#VALUE!"},{"$error":"#VALUE!"},0,{"$error":"#VALUE!"},{"$f":"IF(S1606<='Collection System Summary_Table'!$I$8,\"Yes\",\"NO\")","v":"Yes"}]
[null,null,null,null,null,null,null,null,null,null,null,null,0,{"$error":"#VALUE!"},{"$error":"#VALUE!"},0,{"$error":"#VALUE!"},{"$error":"#VALUE!"},0,{"$error":"#VALUE!"},{"$f":"IF(S1607<='Collection System Summary_Table'!$I$8,\"Yes\",\"NO\")","v":"Yes"}]
[null,null,null,null,null,null,null,null,null,null,null,null,0,{"$error":"#VALUE!"},{"$error":"#VALUE!"},0,{"$error":"#VALUE!"},{"$error":"#VALUE!"},0,{"$error":"#VALUE!"},{"$f":"IF(S1608<='Collection System Summary_Table'!$I$8,\"Yes\",\"NO\")","v":"Yes"}]
[null,null,null,null,null,null,null,null,null,null,null,null,0,{"$error":"#VALUE!"},{"$error":"#VALUE!"},0,{"$error":"#VALUE!"},{"$error":"#VALUE!"},0,{"$error":"#VALUE!"},{"$f":"IF(S1609<='Collection System Summary_Table'!$I$8,\"Yes\",\"NO\")","v":"Yes"}]
[null,null,null,null,null,null,null,null,null,null,null,null,0,{"$error":"#VALUE!"},{"$error":"#VALUE!"},0,{"$error":"#VALUE!"},{"$error":"#VALUE!"},0,{"$error":"#VALUE!"},{"$f":"IF(S1610<='Collection System Summary_Table'!$I$8,\"Yes\",\"NO\")","v":"Yes"}]
[null,null,null,null,null,null,null,null,null,null,null,null,0,{"$error":"#VALUE!"},{"$error":"#VALUE!"},0,{"$error":"#VALUE!"},{"$error":"#VALUE!"},0,{"$error":"#VALUE!"},{"$f":"IF(S1611<='Collection System Summary_Table'!$I$8,\"Yes\",\"NO\")","v":"Yes"}]
[null,null,null,null,null,null,null,null,null,null,null,null,0,{"$error":"#VALUE!"},{"$error":"#VALUE!"},0,{"$error":"#VALUE!"},{"$error":"#VALUE!"},0,{"$error":"#VALUE!"},{"$f":"IF(S1612<='Collection System Summary_Table'!$I$8,\"Yes\",\"NO\")","v":"Yes"}]
[null,null,null,null,null,null,null,null,null,null,null,null,0,{"$error":"#VALUE!"},{"$error":"#VALUE!"},0,{"$error":"#VALUE!"},{"$error":"#VALUE!"},0,{"$error":"#VALUE!"},{"$f":"IF(S1613<='Collection System Summary_Table'!$I$8,\"Yes\",\"NO\")","v":"Yes"}]
[null,null,null,null,null,null,null,null,null,null,null,null,0,{"$error":"#VALUE!"},{"$error":"#VALUE!"},0,{"$error":"#VALUE!"},{"$error":"#VALUE!"},0,{"$error":"#VALUE!"},{"$f":"IF(S1614<='Collection System Summary_Table'!$I$8,\"Yes\",\"NO\")","v":"Yes"}]
[null,null,null,null,null,null,null,null,null,null,null,null,0,{"$error":"#VALUE!"},{"$error":"#VALUE!"},0,{"$error":"#VALUE!"},{"$error":"#VALUE!"},0,{"$error":"#VALUE!"},{"$f":"IF(S1615<='Collection System Summary_Table'!$I$8,\"Yes\",\"NO\")","v":"Yes"}]
[null,null,null,null,null,null,null,null,null,null,null,null,0,{"$error":"#VALUE!"},{"$error":"#VALUE!"},0,{"$error":"#VALUE!"},{"$error":"#VALUE!"},0,{"$error":"#VALUE!"},{"$f":"IF(S1616<='Collection System Summary_Table'!$I$8,\"Yes\",\"NO\")","v":"Yes"}]
[null,null,null,null,null,null,null,null,null,null,null,null,0,{"$error":"#VALUE!"},{"$error":"#VALUE!"},0,{"$error":"#VALUE!"},{"$error":"#VALUE!"},0,{"$error":"#VALUE!"},{"$f":"IF(S1617<='Collection System Summary_Table'!$I$8,\"Yes\",\"NO\")","v":"Yes"}]
[null,null,null,null,null,null,null,null,null,null,null,null,0,{"$error":"#VALUE!"},{"$error":"#VALUE!"},0,{"$error":"#VALUE!"},{"$error":"#VALUE!"},0,{"$error":"#VALUE!"},{"$f":"IF(S1618<='Collection System Summary_Table'!$I$8,\"Yes\",\"NO\")","v":"Yes"}]
[null,null,null,null,null,null,null,null,null,null,null,null,0,{"$error":"#VALUE!"},{"$error":"#VALUE!"},0,{"$error":"#VALUE!"},{"$error":"#VALUE!"},0,{"$error":"#VALUE!"},{"$f":"IF(S1619<='Collection System Summary_Table'!$I$8,\"Yes\",\"NO\")","v":"Yes"}]
[null,null,null,null,null,null,null,null,null,null,null,null,0,{"$error":"#VALUE!"},{"$error":"#VALUE!"},0,{"$error":"#VALUE!"},{"$error":"#VALUE!"},0,{"$error":"#VALUE!"},{"$f":"IF(S1620<='Collection System Summary_Table'!$I$8,\"Yes\",\"NO\")","v":"Yes"}]
[null,null,null,null,null,null,null,null,null,null,null,null,0,{"$error":"#VALUE!"},{"$error":"#VALUE!"},0,{"$error":"#VALUE!"},{"$error":"#VALUE!"},0,{"$error":"#VALUE!"},{"$f":"IF(S1621<='Collection System Summary_Table'!$I$8,\"Yes\",\"NO\")","v":"Yes"}]
[null,null,null,null,null,null,null,null,null,null,null,null,0,{"$error":"#VALUE!"},{"$error":"#VALUE!"},0,{"$error":"#VALUE!"},{"$error":"#VALUE!"},0,{"$error":"#VALUE!"},{"$f":"IF(S1622<='Collection System Summary_Table'!$I$8,\"Yes\",\"NO\")","v":"Yes"}]
[null,null,null,null,null,null,null,null,null,null,null,null,0,{"$error":"#VALUE!"},{"$error":"#VALUE!"},0,{"$error":"#VALUE!"},{"$error":"#VALUE!"},0,{"$error":"#VALUE!"},{"$f":"IF(S1623<='Collection System Summary_Table'!$I$8,\"Yes\",\"NO\")","v":"Yes"}]
[null,null,null,null,null,null,null,null,null,null,null,null,0,{"$error":"#VALUE!"},{"$error":"#VALUE!"},0,{"$error":"#VALUE!"},{"$error":"#VALUE!"},0,{"$error":"#VALUE!"},{"$f":"IF(S1624<='Collection System Summary_Table'!$I$8,\"Yes\",\"NO\")","v":"Yes"}]
[null,null,null,null,null,null,null,null,null,null,null,null,0,{"$error":"#VALUE!"},{"$error":"#VALUE!"},0,{"$error":"#VALUE!"},{"$error":"#VALUE!"},0,{"$error":"#VALUE!"},{"$f":"IF(S1625<='Collection System Summary_Table'!$I$8,\"Yes\",\"NO\")","v":"Yes"}]
[null,null,null,null,null,null,null,null,null,null,null,null,0,{"$error":"#VALUE!"},{"$error":"#VALUE!"},0,{"$error":"#VALUE!"},{"$error":"#VALUE!"},0,{"$error":"#VALUE!"},{"$f":"IF(S1626<='Collection System Summary_Table'!$I$8,\"Yes\",\"NO\")","v":"Yes"}]
[null,null,null,null,null,null,null,null,null,null,null,null,0,{"$error":"#VALUE!"},{"$error":"#VALUE!"},0,{"$error":"#VALUE!"},{"$error":"#VALUE!"},0,{"$error":"#VALUE!"},{"$f":"IF(S1627<='Collection System Summary_Table'!$I$8,\"Yes\",\"NO\")","v":"Yes"}]
[null,null,null,null,null,null,null,null,null,null,null,null,0,{"$error":"#VALUE!"},{"$error":"#VALUE!"},0,{"$error":"#VALUE!"},{"$error":"#VALUE!"},0,{"$error":"#VALUE!"},{"$f":"IF(S1628<='Collection System Summary_Table'!$I$8,\"Yes\",\"NO\")","v":"Yes"}]
[null,null,null,null,null,null,null,null,null,null,null,null,0,{"$error":"#VALUE!"},{"$error":"#VALUE!"},0,{"$error":"#VALUE!"},{"$error":"#VALUE!"},0,{"$error":"#VALUE!"},{"$f":"IF(S1629<='Collection System Summary_Table'!$I$8,\"Yes\",\"NO\")","v":"Yes"}]
[null,null,null,null,null,null,null,null,null,null,null,null,0,{"$error":"#VALUE!"},{"$error":"#VALUE!"},0,{"$error":"#VALUE!"},{"$error":"#VALUE!"},0,{"$error":"#VALUE!"},{"$f":"IF(S1630<='Collection System Summary_Table'!$I$8,\"Yes\",\"NO\")","v":"Yes"}]
[null,null,null,null,null,null,null,null,null,null,null,null,0,{"$error":"#VALUE!"},{"$error":"#VALUE!"},0,{"$error":"#VALUE!"},{"$error":"#VALUE!"},0,{"$error":"#VALUE!"},{"$f":"IF(S1631<='Collection System Summary_Table'!$I$8,\"Yes\",\"NO\")","v":"Yes"}]
[null,null,null,null,null,null,null,null,null,null,null,null,0,{"$error":"#VALUE!"},{"$error":"#VALUE!"},0,{"$error":"#VALUE!"},{"$error":"#VALUE!"},0,{"$error":"#VALUE!"},{"$f":"IF(S1632<='Collection System Summary_Table'!$I$8,\"Yes\",\"NO\")","v":"Yes"}]
[null,null,null,null,null,null,null,null,null,null,null,null,0,{"$error":"#VALUE!"},{"$error":"#VALUE!"},0,{"$error":"#VALUE!"},{"$error":"#VALUE!"},0,{"$error":"#VALUE!"},{"$f":"IF(S1633<='Collection System Summary_Table'!$I$8,\"Yes\",\"NO\")","v":"Yes"}]
[null,null,null,null,null,null,null,null,null,null,null,null,0,{"$error":"#VALUE!"},{"$error":"#VALUE!"},0,{"$error":"#VALUE!"},{"$error":"#VALUE!"},0,{"$error":"#VALUE!"},{"$f":"IF(S1634<='Collection System Summary_Table'!$I$8,\"Yes\",\"NO\")","v":"Yes"}]
[null,null,null,null,null,null,null,null,null,null,null,null,0,{"$error":"#VALUE!"},{"$error":"#VALUE!"},0,{"$error":"#VALUE!"},{"$error":"#VALUE!"},0,{"$error":"#VALUE!"},{"$f":"IF(S1635<='Collection System Summary_Table'!$I$8,\"Yes\",\"NO\")","v":"Yes"}]
[null,null,null,null,null,null,null,null,null,null,null,null,0,{"$error":"#VALUE!"},{"$error":"#VALUE!"},0,{"$error":"#VALUE!"},{"$error":"#VALUE!"},0,{"$error":"#VALUE!"},{"$f":"IF(S1636<='Collection System Summary_Table'!$I$8,\"Yes\",\"NO\")","v":"Yes"}]
[null,null,null,null,null,null,null,null,null,null,null,null,0,{"$error":"#VALUE!"},{"$error":"#VALUE!"},0,{"$error":"#VALUE!"},{"$error":"#VALUE!"},0,{"$error":"#VALUE!"},{"$f":"IF(S1637<='Collection System Summary_Table'!$I$8,\"Yes\",\"NO\")","v":"Yes"}]
[null,null,null,null,null,null,null,null,null,null,null,null,0,{"$error":"#VALUE!"},{"$error":"#VALUE!"},0,{"$error":"#VALUE!"},{"$error":"#VALUE!"},0,{"$error":"#VALUE!"},{"$f":"IF(S1638<='Collection System Summary_Table'!$I$8,\"Yes\",\"NO\")","v":"Yes"}]
[null,null,null,null,null,null,null,null,null,null,null,null,0,{"$error":"#VALUE!"},{"$error":"#VALUE!"},0,{"$error":"#VALUE!"},{"$error":"#VALUE!"},0,{"$error":"#VALUE!"},{"$f":"IF(S1639<='Collection System Summary_Table'!$I$8,\"Yes\",\"NO\")","v":"Yes"}]
[null,null,null,null,null,null,null,null,null,null,null,null,0,{"$error":"#VALUE!"},{"$error":"#VALUE!"},0,{"$error":"#VALUE!"},{"$error":"#VALUE!"},0,{"$error":"#VALUE!"},{"$f":"IF(S1640<='Collection System Summary_Table'!$I$8,\"Yes\",\"NO\")","v":"Yes"}]
[null,null,null,null,null,null,null,null,null,null,null,null,0,{"$error":"#VALUE!"},{"$error":"#VALUE!"},0,{"$error":"#VALUE!"},{"$error":"#VALUE!"},0,{"$error":"#VALUE!"},{"$f":"IF(S1641<='Collection System Summary_Table'!$I$8,\"Yes\",\"NO\")","v":"Yes"}]
[null,null,null,null,null,null,null,null,null,null,null,null,0,{"$error":"#VALUE!"},{"$error":"#VALUE!"},0,{"$error":"#VALUE!"},{"$error":"#VALUE!"},0,{"$error":"#VALUE!"},{"$f":"IF(S1642<='Collection System Summary_Table'!$I$8,\"Yes\",\"NO\")","v":"Yes"}]
[null,null,null,null,null,null,null,null,null,null,null,null,0,{"$error":"#VALUE!"},{"$error":"#VALUE!"},0,{"$error":"#VALUE!"},{"$error":"#VALUE!"},0,{"$error":"#VALUE!"},{"$f":"IF(S1643<='Collection System Summary_Table'!$I$8,\"Yes\",\"NO\")","v":"Yes"}]
[null,null,null,null,null,null,null,null,null,null,null,null,0,{"$error":"#VALUE!"},{"$error":"#VALUE!"},0,{"$error":"#VALUE!"},{"$error":"#VALUE!"},0,{"$error":"#VALUE!"},{"$f":"IF(S1644<='Collection System Summary_Table'!$I$8,\"Yes\",\"NO\")","v":"Yes"}]
[null,null,null,null,null,null,null,null,null,null,null,null,0,{"$error":"#VALUE!"},{"$error":"#VALUE!"},0,{"$error":"#VALUE!"},{"$error":"#VALUE!"},0,{"$error":"#VALUE!"},{"$f":"IF(S1645<='Collection System Summary_Table'!$I$8,\"Yes\",\"NO\")","v":"Yes"}]
[null,null,null,null,null,null,null,null,null,null,null,null,0,{"$error":"#VALUE!"},{"$error":"#VALUE!"},0,{"$error":"#VALUE!"},{"$error":"#VALUE!"},0,{"$error":"#VALUE!"},{"$f":"IF(S1646<='Collection System Summary_Table'!$I$8,\"Yes\",\"NO\")","v":"Yes"}]
[null,null,null,null,null,null,null,null,null,null,null,null,0,{"$error":"#VALUE!"},{"$error":"#VALUE!"},0,{"$error":"#VALUE!"},{"$error":"#VALUE!"},0,{"$error":"#VALUE!"},{"$f":"IF(S1647<='Collection System Summary_Table'!$I$8,\"Yes\",\"NO\")","v":"Yes"}]
[null,null,null,null,null,null,null,null,null,null,null,null,0,{"$error":"#VALUE!"},{"$error":"#VALUE!"},0,{"$error":"#VALUE!"},{"$error":"#VALUE!"},0,{"$error":"#VALUE!"},{"$f":"IF(S1648<='Collection System Summary_Table'!$I$8,\"Yes\",\"NO\")","v":"Yes"}]
[null,null,null,null,null,null,null,null,null,null,null,null,0,{"$error":"#VALUE!"},{"$error":"#VALUE!"},0,{"$error":"#VALUE!"},{"$error":"#VALUE!"},0,{"$error":"#VALUE!"},{"$f":"IF(S1649<='Collection System Summary_Table'!$I$8,\"Yes\",\"NO\")","v":"Yes"}]
[null,null,null,null,null,null,null,null,null,null,null,null,0,{"$error":"#VALUE!"},{"$error":"#VALUE!"},0,{"$error":"#VALUE!"},{"$error":"#VALUE!"},0,{"$error":"#VALUE!"},{"$f":"IF(S1650<='Collection System Summary_Table'!$I$8,\"Yes\",\"NO\")","v":"Yes"}]
[null,null,null,null,null,null,null,null,null,null,null,null,0,{"$error":"#VALUE!"},{"$error":"#VALUE!"},0,{"$error":"#VALUE!"},{"$error":"#VALUE!"},0,{"$error":"#VALUE!"},{"$f":"IF(S1651<='Collection System Summary_Table'!$I$8,\"Yes\",\"NO\")","v":"Yes"}]
[null,null,null,null,null,null,null,null,null,null,null,null,0,{"$error":"#VALUE!"},{"$error":"#VALUE!"},0,{"$error":"#VALUE!"},{"$error":"#VALUE!"},0,{"$error":"#VALUE!"},{"$f":"IF(S1652<='Collection System Summary_Table'!$I$8,\"Yes\",\"NO\")","v":"Yes"}]
[null,null,null,null,null,null,null,null,null,null,null,null,0,{"$error":"#VALUE!"},{"$error":"#VALUE!"},0,{"$error":"#VALUE!"},{"$error":"#VALUE!"},0,{"$error":"#VALUE!"},{"$f":"IF(S1653<='Collection System Summary_Table'!$I$8,\"Yes\",\"NO\")","v":"Yes"}]
[null,null,null,null,null,null,null,null,null,null,null,null,0,{"$error":"#VALUE!"},{"$error":"#VALUE!"},0,{"$error":"#VALUE!"},{"$error":"#VALUE!"},0,{"$error":"#VALUE!"},{"$f":"IF(S1654<='Collection System Summary_Table'!$I$8,\"Yes\",\"NO\")","v":"Yes"}]
[null,null,null,null,null,null,null,null,null,null,null,null,0,{"$error":"#VALUE!"},{"$error":"#VALUE!"},0,{"$error":"#VALUE!"},{"$error":"#VALUE!"},0,{"$error":"#VALUE!"},{"$f":"IF(S1655<='Collection System Summary_Table'!$I$8,\"Yes\",\"NO\")","v":"Yes"}]
[null,null,null,null,null,null,null,null,null,null,null,null,0,{"$error":"#VALUE!"},{"$error":"#VALUE!"},0,{"$error":"#VALUE!"},{"$error":"#VALUE!"},0,{"$error":"#VALUE!"},{"$f":"IF(S1656<='Collection System Summary_Table'!$I$8,\"Yes\",\"NO\")","v":"Yes"}]
[null,null,null,null,null,null,null,null,null,null,null,null,0,{"$error":"#VALUE!"},{"$error":"#VALUE!"},0,{"$error":"#VALUE!"},{"$error":"#VALUE!"},0,{"$error":"#VALUE!"},{"$f":"IF(S1657<='Collection System Summary_Table'!$I$8,\"Yes\",\"NO\")","v":"Yes"}]
[null,null,null,null,null,null,null,null,null,null,null,null,0,{"$error":"#VALUE!"},{"$error":"#VALUE!"},0,{"$error":"#VALUE!"},{"$error":"#VALUE!"},0,{"$error":"#VALUE!"},{"$f":"IF(S1658<='Collection System Summary_Table'!$I$8,\"Yes\",\"NO\")","v":"Yes"}]
[null,null,null,null,null,null,null,null,null,null,null,null,0,{"$error":"#VALUE!"},{"$error":"#VALUE!"},0,{"$error":"#VALUE!"},{"$error":"#VALUE!"},0,{"$error":"#VALUE!"},{"$f":"IF(S1659<='Collection System Summary_Table'!$I$8,\"Yes\",\"NO\")","v":"Yes"}]
[null,null,null,null,null,null,null,null,null,null,null,null,0,{"$error":"#VALUE!"},{"$error":"#VALUE!"},0,{"$error":"#VALUE!"},{"$error":"#VALUE!"},0,{"$error":"#VALUE!"},{"$f":"IF(S1660<='Collection System Summary_Table'!$I$8,\"Yes\",\"NO\")","v":"Yes"}]
[null,null,null,null,null,null,null,null,null,null,null,null,0,{"$error":"#VALUE!"},{"$error":"#VALUE!"},0,{"$error":"#VALUE!"},{"$error":"#VALUE!"},0,{"$error":"#VALUE!"},{"$f":"IF(S1661<='Collection System Summary_Table'!$I$8,\"Yes\",\"NO\")","v":"Yes"}]
[null,null,null,null,null,null,null,null,null,null,null,null,0,{"$error":"#VALUE!"},{"$error":"#VALUE!"},0,{"$error":"#VALUE!"},{"$error":"#VALUE!"},0,{"$error":"#VALUE!"},{"$f":"IF(S1662<='Collection System Summary_Table'!$I$8,\"Yes\",\"NO\")","v":"Yes"}]
[null,null,null,null,null,null,null,null,null,null,null,null,0,{"$error":"#VALUE!"},{"$error":"#VALUE!"},0,{"$error":"#VALUE!"},{"$error":"#VALUE!"},0,{"$error":"#VALUE!"},{"$f":"IF(S1663<='Collection System Summary_Table'!$I$8,\"Yes\",\"NO\")","v":"Yes"}]
[null,null,null,null,null,null,null,null,null,null,null,null,0,{"$error":"#VALUE!"},{"$error":"#VALUE!"},0,{"$error":"#VALUE!"},{"$error":"#VALUE!"},0,{"$error":"#VALUE!"},{"$f":"IF(S1664<='Collection System Summary_Table'!$I$8,\"Yes\",\"NO\")","v":"Yes"}]
[null,null,null,null,null,null,null,null,null,null,null,null,0,{"$error":"#VALUE!"},{"$error":"#VALUE!"},0,{"$error":"#VALUE!"},{"$error":"#VALUE!"},0,{"$error":"#VALUE!"},{"$f":"IF(S1665<='Collection System Summary_Table'!$I$8,\"Yes\",\"NO\")","v":"Yes"}]
[null,null,null,null,null,null,null,null,null,null,null,null,0,{"$error":"#VALUE!"},{"$error":"#VALUE!"},0,{"$error":"#VALUE!"},{"$error":"#VALUE!"},0,{"$error":"#VALUE!"},{"$f":"IF(S1666<='Collection System Summary_Table'!$I$8,\"Yes\",\"NO\")","v":"Yes"}]
[null,null,null,null,null,null,null,null,null,null,null,null,0,{"$f":"IF(P1667=0,I1667+N1666,0)","v":{"$error":"#VALUE!"}},{"$error":"#VALUE!"},0,{"$error":"#VALUE!"},{"$error":"#VALUE!"},0,{"$error":"#VALUE!"},{"$f":"IF(S1667<='Collection System Summary_Table'!$I$8,\"Yes\",\"NO\")","v":"Yes"}]
[null,null,null,null,null,null,null,null,null,null,null,null,0,{"$error":"#VALUE!"},{"$f":"IF(AND(Q1668=0,P1668=0),K1668+O1667,0)","v":{"$error":"#VALUE!"}},0,{"$f":"IF(AND(P1668=0,N1668<($B$4+$P$1)),J1668,0)","v":{"$error":"#VALUE!"}},{"$f":"IF(AND(P1668=0,Q1668=0,O1668<($B$5+$Q$1)),K1668,0)","v":{"$error":"#VALUE!"}},{"$f":"S1667+L1668","v":0},{"$f":"IF(OR(P1668>1,Q1668>1,R1668>1),\"YES\",\"NO\")","v":{"$error":"#VALUE!"}},{"$f":"IF(S1668<='Collection System Summary_Table'!$I$8,\"Yes\",\"NO\")","v":"Yes"}]
[null,null,null,null,null,null,null,null,null,null,null,null,{"$f":"M1668+I1669","v":0},{"$error":"#VALUE!"},{"$error":"#VALUE!"},{"$f":"IF(M1669<=$B$3,I1669,0)","v":0},{"$error":"#VALUE!"},{"$error":"#VALUE!"},0,{"$error":"#VALUE!"},{"$f":"IF(S1669<='Collection System Summary_Table'!$I$8,\"Yes\",\"NO\")","v":"Yes"}]
[null,null,null,null,null,null,null,null,null,null,null,null,0,{"$error":"#VALUE!"},{"$error":"#VALUE!"},0,{"$error":"#VALUE!"},{"$error":"#VALUE!"},0,{"$error":"#VALUE!"},{"$f":"IF(S1670<='Collection System Summary_Table'!$I$8,\"Yes\",\"NO\")","v":"Yes"}]
[null,null,null,null,null,null,null,null,null,null,null,null,0,{"$error":"#VALUE!"},{"$error":"#VALUE!"},0,{"$error":"#VALUE!"},{"$error":"#VALUE!"},0,{"$error":"#VALUE!"},{"$f":"IF(S1671<='Collection System Summary_Table'!$I$8,\"Yes\",\"NO\")","v":"Yes"}]
[null,null,null,null,null,null,null,null,null,null,null,null,0,{"$error":"#VALUE!"},{"$error":"#VALUE!"},0,{"$error":"#VALUE!"},{"$error":"#VALUE!"},0,{"$error":"#VALUE!"},{"$f":"IF(S1672<='Collection System Summary_Table'!$I$8,\"Yes\",\"NO\")","v":"Yes"}]
[null,null,null,null,null,null,null,null,null,null,null,null,0,{"$error":"#VALUE!"},{"$error":"#VALUE!"},0,{"$error":"#VALUE!"},{"$error":"#VALUE!"},0,{"$error":"#VALUE!"},{"$f":"IF(S1673<='Collection System Summary_Table'!$I$8,\"Yes\",\"NO\")","v":"Yes"}]
[null,null,null,null,null,null,null,null,null,null,null,null,0,{"$error":"#VALUE!"},{"$error":"#VALUE!"},0,{"$error":"#VALUE!"},{"$error":"#VALUE!"},0,{"$error":"#VALUE!"},{"$f":"IF(S1674<='Collection System Summary_Table'!$I$8,\"Yes\",\"NO\")","v":"Yes"}]
[null,null,null,null,null,null,null,null,null,null,null,null,0,{"$error":"#VALUE!"},{"$error":"#VALUE!"},0,{"$error":"#VALUE!"},{"$error":"#VALUE!"},0,{"$error":"#VALUE!"},{"$f":"IF(S1675<='Collection System Summary_Table'!$I$8,\"Yes\",\"NO\")","v":"Yes"}]
[null,null,null,null,null,null,null,null,null,null,null,null,0,{"$error":"#VALUE!"},{"$error":"#VALUE!"},0,{"$error":"#VALUE!"},{"$error":"#VALUE!"},0,{"$error":"#VALUE!"},{"$f":"IF(S1676<='Collection System Summary_Table'!$I$8,\"Yes\",\"NO\")","v":"Yes"}]
[null,null,null,null,null,null,null,null,null,null,null,null,0,{"$error":"#VALUE!"},{"$error":"#VALUE!"},0,{"$error":"#VALUE!"},{"$error":"#VALUE!"},0,{"$error":"#VALUE!"},{"$f":"IF(S1677<='Collection System Summary_Table'!$I$8,\"Yes\",\"NO\")","v":"Yes"}]
[null,null,null,null,null,null,null,null,null,null,null,null,0,{"$error":"#VALUE!"},{"$error":"#VALUE!"},0,{"$error":"#VALUE!"},{"$error":"#VALUE!"},0,{"$error":"#VALUE!"},{"$f":"IF(S1678<='Collection System Summary_Table'!$I$8,\"Yes\",\"NO\")","v":"Yes"}]
[null,null,null,null,null,null,null,null,null,null,null,null,0,{"$error":"#VALUE!"},{"$error":"#VALUE!"},0,{"$error":"#VALUE!"},{"$error":"#VALUE!"},0,{"$error":"#VALUE!"},{"$f":"IF(S1679<='Collection System Summary_Table'!$I$8,\"Yes\",\"NO\")","v":"Yes"}]
[null,null,null,null,null,null,null,null,null,null,null,null,0,{"$error":"#VALUE!"},{"$error":"#VALUE!"},0,{"$error":"#VALUE!"},{"$error":"#VALUE!"},0,{"$error":"#VALUE!"},{"$f":"IF(S1680<='Collection System Summary_Table'!$I$8,\"Yes\",\"NO\")","v":"Yes"}]
[null,null,null,null,null,null,null,null,null,null,null,null,0,{"$error":"#VALUE!"},{"$error":"#VALUE!"},0,{"$error":"#VALUE!"},{"$error":"#VALUE!"},0,{"$error":"#VALUE!"},{"$f":"IF(S1681<='Collection System Summary_Table'!$I$8,\"Yes\",\"NO\")","v":"Yes"}]
[null,null,null,null,null,null,null,null,null,null,null,null,0,{"$error":"#VALUE!"},{"$error":"#VALUE!"},0,{"$error":"#VALUE!"},{"$error":"#VALUE!"},0,{"$error":"#VALUE!"},{"$f":"IF(S1682<='Collection System Summary_Table'!$I$8,\"Yes\",\"NO\")","v":"Yes"}]
[null,null,null,null,null,null,null,null,null,null,null,null,0,{"$error":"#VALUE!"},{"$error":"#VALUE!"},0,{"$error":"#VALUE!"},{"$error":"#VALUE!"},0,{"$error":"#VALUE!"},{"$f":"IF(S1683<='Collection System Summary_Table'!$I$8,\"Yes\",\"NO\")","v":"Yes"}]
[null,null,null,null,null,null,null,null,null,null,null,null,0,{"$error":"#VALUE!"},{"$error":"#VALUE!"},0,{"$error":"#VALUE!"},{"$error":"#VALUE!"},0,{"$error":"#VALUE!"},{"$f":"IF(S1684<='Collection System Summary_Table'!$I$8,\"Yes\",\"NO\")","v":"Yes"}]
[null,null,null,null,null,null,null,null,null,null,null,null,0,{"$error":"#VALUE!"},{"$error":"#VALUE!"},0,{"$error":"#VALUE!"},{"$error":"#VALUE!"},0,{"$error":"#VALUE!"},{"$f":"IF(S1685<='Collection System Summary_Table'!$I$8,\"Yes\",\"NO\")","v":"Yes"}]
[null,null,null,null,null,null,null,null,null,null,null,null,0,{"$error":"#VALUE!"},{"$error":"#VALUE!"},0,{"$error":"#VALUE!"},{"$error":"#VALUE!"},0,{"$error":"#VALUE!"},{"$f":"IF(S1686<='Collection System Summary_Table'!$I$8,\"Yes\",\"NO\")","v":"Yes"}]
[null,null,null,null,null,null,null,null,null,null,null,null,0,{"$error":"#VALUE!"},{"$error":"#VALUE!"},0,{"$error":"#VALUE!"},{"$error":"#VALUE!"},0,{"$error":"#VALUE!"},{"$f":"IF(S1687<='Collection System Summary_Table'!$I$8,\"Yes\",\"NO\")","v":"Yes"}]
[null,null,null,null,null,null,null,null,null,null,null,null,0,{"$error":"#VALUE!"},{"$error":"#VALUE!"},0,{"$error":"#VALUE!"},{"$error":"#VALUE!"},0,{"$error":"#VALUE!"},{"$f":"IF(S1688<='Collection System Summary_Table'!$I$8,\"Yes\",\"NO\")","v":"Yes"}]
[null,null,null,null,null,null,null,null,null,null,null,null,0,{"$error":"#VALUE!"},{"$error":"#VALUE!"},0,{"$error":"#VALUE!"},{"$error":"#VALUE!"},0,{"$error":"#VALUE!"},{"$f":"IF(S1689<='Collection System Summary_Table'!$I$8,\"Yes\",\"NO\")","v":"Yes"}]
[null,null,null,null,null,null,null,null,null,null,null,null,0,{"$error":"#VALUE!"},{"$error":"#VALUE!"},0,{"$error":"#VALUE!"},{"$error":"#VALUE!"},0,{"$error":"#VALUE!"},{"$f":"IF(S1690<='Collection System Summary_Table'!$I$8,\"Yes\",\"NO\")","v":"Yes"}]
[null,null,null,null,null,null,null,null,null,null,null,null,0,{"$error":"#VALUE!"},{"$error":"#VALUE!"},0,{"$error":"#VALUE!"},{"$error":"#VALUE!"},0,{"$error":"#VALUE!"},{"$f":"IF(S1691<='Collection System Summary_Table'!$I$8,\"Yes\",\"NO\")","v":"Yes"}]
[null,null,null,null,null,null,null,null,null,null,null,null,0,{"$error":"#VALUE!"},{"$error":"#VALUE!"},0,{"$error":"#VALUE!"},{"$error":"#VALUE!"},0,{"$error":"#VALUE!"},{"$f":"IF(S1692<='Collection System Summary_Table'!$I$8,\"Yes\",\"NO\")","v":"Yes"}]
[null,null,null,null,null,null,null,null,null,null,null,null,0,{"$error":"#VALUE!"},{"$error":"#VALUE!"},0,{"$error":"#VALUE!"},{"$error":"#VALUE!"},0,{"$error":"#VALUE!"},{"$f":"IF(S1693<='Collection System Summary_Table'!$I$8,\"Yes\",\"NO\")","v":"Yes"}]
[null,null,null,null,null,null,null,null,null,null,null,null,0,{"$error":"#VALUE!"},{"$error":"#VALUE!"},0,{"$error":"#VALUE!"},{"$error":"#VALUE!"},0,{"$error":"#VALUE!"},{"$f":"IF(S1694<='Collection System Summary_Table'!$I$8,\"Yes\",\"NO\")","v":"Yes"}]
[null,null,null,null,null,null,null,null,null,null,null,null,0,{"$error":"#VALUE!"},{"$error":"#VALUE!"},0,{"$error":"#VALUE!"},{"$error":"#VALUE!"},0,{"$error":"#VALUE!"},{"$f":"IF(S1695<='Collection System Summary_Table'!$I$8,\"Yes\",\"NO\")","v":"Yes"}]
[null,null,null,null,null,null,null,null,null,null,null,null,0,{"$error":"#VALUE!"},{"$error":"#VALUE!"},0,{"$error":"#VALUE!"},{"$error":"#VALUE!"},0,{"$error":"#VALUE!"},{"$f":"IF(S1696<='Collection System Summary_Table'!$I$8,\"Yes\",\"NO\")","v":"Yes"}]
[null,null,null,null,null,null,null,null,null,null,null,null,0,{"$error":"#VALUE!"},{"$error":"#VALUE!"},0,{"$error":"#VALUE!"},{"$error":"#VALUE!"},0,{"$error":"#VALUE!"},{"$f":"IF(S1697<='Collection System Summary_Table'!$I$8,\"Yes\",\"NO\")","v":"Yes"}]
[null,null,null,null,null,null,null,null,null,null,null,null,0,{"$error":"#VALUE!"},{"$error":"#VALUE!"},0,{"$error":"#VALUE!"},{"$error":"#VALUE!"},0,{"$error":"#VALUE!"},{"$f":"IF(S1698<='Collection System Summary_Table'!$I$8,\"Yes\",\"NO\")","v":"Yes"}]
[null,null,null,null,null,null,null,null,null,null,null,null,0,{"$error":"#VALUE!"},{"$error":"#VALUE!"},0,{"$error":"#VALUE!"},{"$error":"#VALUE!"},0,{"$error":"#VALUE!"},{"$f":"IF(S1699<='Collection System Summary_Table'!$I$8,\"Yes\",\"NO\")","v":"Yes"}]
[null,null,null,null,null,null,null,null,null,null,null,null,0,{"$error":"#VALUE!"},{"$error":"#VALUE!"},0,{"$error":"#VALUE!"},{"$error":"#VALUE!"},0,{"$error":"#VALUE!"},{"$f":"IF(S1700<='Collection System Summary_Table'!$I$8,\"Yes\",\"NO\")","v":"Yes"}]
[null,null,null,null,null,null,null,null,null,null,null,null,0,{"$error":"#VALUE!"},{"$error":"#VALUE!"},0,{"$error":"#VALUE!"},{"$error":"#VALUE!"},0,{"$error":"#VALUE!"},{"$f":"IF(S1701<='Collection System Summary_Table'!$I$8,\"Yes\",\"NO\")","v":"Yes"}]
[null,null,null,null,null,null,null,null,null,null,null,null,0,{"$error":"#VALUE!"},{"$error":"#VALUE!"},0,{"$error":"#VALUE!"},{"$error":"#VALUE!"},0,{"$error":"#VALUE!"},{"$f":"IF(S1702<='Collection System Summary_Table'!$I$8,\"Yes\",\"NO\")","v":"Yes"}]
[null,null,null,null,null,null,null,null,null,null,null,null,0,{"$error":"#VALUE!"},{"$error":"#VALUE!"},0,{"$error":"#VALUE!"},{"$error":"#VALUE!"},0,{"$error":"#VALUE!"},{"$f":"IF(S1703<='Collection System Summary_Table'!$I$8,\"Yes\",\"NO\")","v":"Yes"}]
[null,null,null,null,null,null,null,null,null,null,null,null,0,{"$error":"#VALUE!"},{"$error":"#VALUE!"},0,{"$error":"#VALUE!"},{"$error":"#VALUE!"},0,{"$error":"#VALUE!"},{"$f":"IF(S1704<='Collection System Summary_Table'!$I$8,\"Yes\",\"NO\")","v":"Yes"}]
[null,null,null,null,null,null,null,null,null,null,null,null,0,{"$error":"#VALUE!"},{"$error":"#VALUE!"},0,{"$error":"#VALUE!"},{"$error":"#VALUE!"},0,{"$error":"#VALUE!"},{"$f":"IF(S1705<='Collection System Summary_Table'!$I$8,\"Yes\",\"NO\")","v":"Yes"}]
[null,null,null,null,null,null,null,null,null,null,null,null,0,{"$error":"#VALUE!"},{"$error":"#VALUE!"},0,{"$error":"#VALUE!"},{"$error":"#VALUE!"},0,{"$error":"#VALUE!"},{"$f":"IF(S1706<='Collection System Summary_Table'!$I$8,\"Yes\",\"NO\")","v":"Yes"}]
[null,null,null,null,null,null,null,null,null,null,null,null,0,{"$error":"#VALUE!"},{"$error":"#VALUE!"},0,{"$error":"#VALUE!"},{"$error":"#VALUE!"},0,{"$error":"#VALUE!"},{"$f":"IF(S1707<='Collection System Summary_Table'!$I$8,\"Yes\",\"NO\")","v":"Yes"}]
[null,null,null,null,null,null,null,null,null,null,null,null,0,{"$error":"#VALUE!"},{"$error":"#VALUE!"},0,{"$error":"#VALUE!"},{"$error":"#VALUE!"},0,{"$error":"#VALUE!"},{"$f":"IF(S1708<='Collection System Summary_Table'!$I$8,\"Yes\",\"NO\")","v":"Yes"}]
[null,null,null,null,null,null,null,null,null,null,null,null,0,{"$error":"#VALUE!"},{"$error":"#VALUE!"},0,{"$error":"#VALUE!"},{"$error":"#VALUE!"},0,{"$error":"#VALUE!"},{"$f":"IF(S1709<='Collection System Summary_Table'!$I$8,\"Yes\",\"NO\")","v":"Yes"}]
[null,null,null,null,null,null,null,null,null,null,null,null,0,{"$error":"#VALUE!"},{"$error":"#VALUE!"},0,{"$error":"#VALUE!"},{"$error":"#VALUE!"},0,{"$error":"#VALUE!"},{"$f":"IF(S1710<='Collection System Summary_Table'!$I$8,\"Yes\",\"NO\")","v":"Yes"}]
[null,null,null,null,null,null,null,null,null,null,null,null,0,{"$error":"#VALUE!"},{"$error":"#VALUE!"},0,{"$error":"#VALUE!"},{"$error":"#VALUE!"},0,{"$error":"#VALUE!"},{"$f":"IF(S1711<='Collection System Summary_Table'!$I$8,\"Yes\",\"NO\")","v":"Yes"}]
[null,null,null,null,null,null,null,null,null,null,null,null,0,{"$error":"#VALUE!"},{"$error":"#VALUE!"},0,{"$error":"#VALUE!"},{"$error":"#VALUE!"},0,{"$error":"#VALUE!"},{"$f":"IF(S1712<='Collection System Summary_Table'!$I$8,\"Yes\",\"NO\")","v":"Yes"}]
[null,null,null,null,null,null,null,null,null,null,null,null,0,{"$error":"#VALUE!"},{"$error":"#VALUE!"},0,{"$error":"#VALUE!"},{"$error":"#VALUE!"},0,{"$error":"#VALUE!"},{"$f":"IF(S1713<='Collection System Summary_Table'!$I$8,\"Yes\",\"NO\")","v":"Yes"}]
[null,null,null,null,null,null,null,null,null,null,null,null,0,{"$error":"#VALUE!"},{"$error":"#VALUE!"},0,{"$error":"#VALUE!"},{"$error":"#VALUE!"},0,{"$error":"#VALUE!"},{"$f":"IF(S1714<='Collection System Summary_Table'!$I$8,\"Yes\",\"NO\")","v":"Yes"}]
[null,null,null,null,null,null,null,null,null,null,null,null,0,{"$error":"#VALUE!"},{"$error":"#VALUE!"},0,{"$error":"#VALUE!"},{"$error":"#VALUE!"},0,{"$error":"#VALUE!"},{"$f":"IF(S1715<='Collection System Summary_Table'!$I$8,\"Yes\",\"NO\")","v":"Yes"}]
[null,null,null,null,null,null,null,null,null,null,null,null,0,{"$error":"#VALUE!"},{"$error":"#VALUE!"},0,{"$error":"#VALUE!"},{"$error":"#VALUE!"},0,{"$error":"#VALUE!"},{"$f":"IF(S1716<='Collection System Summary_Table'!$I$8,\"Yes\",\"NO\")","v":"Yes"}]
[null,null,null,null,null,null,null,null,null,null,null,null,0,{"$error":"#VALUE!"},{"$error":"#VALUE!"},0,{"$error":"#VALUE!"},{"$error":"#VALUE!"},0,{"$error":"#VALUE!"},{"$f":"IF(S1717<='Collection System Summary_Table'!$I$8,\"Yes\",\"NO\")","v":"Yes"}]
[null,null,null,null,null,null,null,null,null,null,null,null,0,{"$error":"#VALUE!"},{"$error":"#VALUE!"},0,{"$error":"#VALUE!"},{"$error":"#VALUE!"},0,{"$error":"#VALUE!"},{"$f":"IF(S1718<='Collection System Summary_Table'!$I$8,\"Yes\",\"NO\")","v":"Yes"}]
[null,null,null,null,null,null,null,null,null,null,null,null,0,{"$error":"#VALUE!"},{"$error":"#VALUE!"},0,{"$error":"#VALUE!"},{"$error":"#VALUE!"},0,{"$error":"#VALUE!"},{"$f":"IF(S1719<='Collection System Summary_Table'!$I$8,\"Yes\",\"NO\")","v":"Yes"}]
[null,null,null,null,null,null,null,null,null,null,null,null,0,{"$error":"#VALUE!"},{"$error":"#VALUE!"},0,{"$error":"#VALUE!"},{"$error":"#VALUE!"},0,{"$error":"#VALUE!"},{"$f":"IF(S1720<='Collection System Summary_Table'!$I$8,\"Yes\",\"NO\")","v":"Yes"}]
[null,null,null,null,null,null,null,null,null,null,null,null,0,{"$error":"#VALUE!"},{"$error":"#VALUE!"},0,{"$error":"#VALUE!"},{"$error":"#VALUE!"},0,{"$error":"#VALUE!"},{"$f":"IF(S1721<='Collection System Summary_Table'!$I$8,\"Yes\",\"NO\")","v":"Yes"}]
[null,null,null,null,null,null,null,null,null,null,null,null,0,{"$error":"#VALUE!"},{"$error":"#VALUE!"},0,{"$error":"#VALUE!"},{"$error":"#VALUE!"},0,{"$error":"#VALUE!"},{"$f":"IF(S1722<='Collection System Summary_Table'!$I$8,\"Yes\",\"NO\")","v":"Yes"}]
[null,null,null,null,null,null,null,null,null,null,null,null,0,{"$error":"#VALUE!"},{"$error":"#VALUE!"},0,{"$error":"#VALUE!"},{"$error":"#VALUE!"},0,{"$error":"#VALUE!"},{"$f":"IF(S1723<='Collection System Summary_Table'!$I$8,\"Yes\",\"NO\")","v":"Yes"}]
[null,null,null,null,null,null,null,null,null,null,null,null,0,{"$error":"#VALUE!"},{"$error":"#VALUE!"},0,{"$error":"#VALUE!"},{"$error":"#VALUE!"},0,{"$error":"#VALUE!"},{"$f":"IF(S1724<='Collection System Summary_Table'!$I$8,\"Yes\",\"NO\")","v":"Yes"}]
[null,null,null,null,null,null,null,null,null,null,null,null,0,{"$error":"#VALUE!"},{"$error":"#VALUE!"},0,{"$error":"#VALUE!"},{"$error":"#VALUE!"},0,{"$error":"#VALUE!"},{"$f":"IF(S1725<='Collection System Summary_Table'!$I$8,\"Yes\",\"NO\")","v":"Yes"}]
[null,null,null,null,null,null,null,null,null,null,null,null,0,{"$error":"#VALUE!"},{"$error":"#VALUE!"},0,{"$error":"#VALUE!"},{"$error":"#VALUE!"},0,{"$error":"#VALUE!"},{"$f":"IF(S1726<='Collection System Summary_Table'!$I$8,\"Yes\",\"NO\")","v":"Yes"}]
[null,null,null,null,null,null,null,null,null,null,null,null,0,{"$error":"#VALUE!"},{"$error":"#VALUE!"},0,{"$error":"#VALUE!"},{"$error":"#VALUE!"},0,{"$error":"#VALUE!"},{"$f":"IF(S1727<='Collection System Summary_Table'!$I$8,\"Yes\",\"NO\")","v":"Yes"}]
[null,null,null,null,null,null,null,null,null,null,null,null,0,{"$error":"#VALUE!"},{"$error":"#VALUE!"},0,{"$error":"#VALUE!"},{"$error":"#VALUE!"},0,{"$error":"#VALUE!"},{"$f":"IF(S1728<='Collection System Summary_Table'!$I$8,\"Yes\",\"NO\")","v":"Yes"}]
[null,null,null,null,null,null,null,null,null,null,null,null,0,{"$error":"#VALUE!"},{"$error":"#VALUE!"},0,{"$error":"#VALUE!"},{"$error":"#VALUE!"},0,{"$error":"#VALUE!"},{"$f":"IF(S1729<='Collection System Summary_Table'!$I$8,\"Yes\",\"NO\")","v":"Yes"}]
[null,null,null,null,null,null,null,null,null,null,null,null,0,{"$error":"#VALUE!"},{"$error":"#VALUE!"},0,{"$error":"#VALUE!"},{"$error":"#VALUE!"},0,{"$error":"#VALUE!"},{"$f":"IF(S1730<='Collection System Summary_Table'!$I$8,\"Yes\",\"NO\")","v":"Yes"}]
[null,null,null,null,null,null,null,null,null,null,null,null,0,{"$f":"IF(P1731=0,I1731+N1730,0)","v":{"$error":"#VALUE!"}},{"$error":"#VALUE!"},0,{"$error":"#VALUE!"},{"$error":"#VALUE!"},0,{"$error":"#VALUE!"},{"$f":"IF(S1731<='Collection System Summary_Table'!$I$8,\"Yes\",\"NO\")","v":"Yes"}]
[null,null,null,null,null,null,null,null,null,null,null,null,0,{"$error":"#VALUE!"},{"$f":"IF(AND(Q1732=0,P1732=0),K1732+O1731,0)","v":{"$error":"#VALUE!"}},0,{"$f":"IF(AND(P1732=0,N1732<($B$4+$P$1)),J1732,0)","v":{"$error":"#VALUE!"}},{"$f":"IF(AND(P1732=0,Q1732=0,O1732<($B$5+$Q$1)),K1732,0)","v":{"$error":"#VALUE!"}},0,{"$f":"IF(OR(P1732>1,Q1732>1,R1732>1),\"YES\",\"NO\")","v":{"$error":"#VALUE!"}},{"$f":"IF(S1732<='Collection System Summary_Table'!$I$8,\"Yes\",\"NO\")","v":"Yes"}]
[null,null,null,null,null,null,null,null,null,null,null,null,{"$f":"M1732+I1733","v":0},{"$error":"#VALUE!"},{"$error":"#VALUE!"},{"$f":"IF(M1733<=$B$3,I1733,0)","v":0},{"$error":"#VALUE!"},{"$error":"#VALUE!"},0,{"$error":"#VALUE!"},{"$f":"IF(S1733<='Collection System Summary_Table'!$I$8,\"Yes\",\"NO\")","v":"Yes"}]
[null,null,null,null,null,null,null,null,null,null,null,null,0,{"$error":"#VALUE!"},{"$error":"#VALUE!"},0,{"$error":"#VALUE!"},{"$error":"#VALUE!"},0,{"$error":"#VALUE!"},{"$f":"IF(S1734<='Collection System Summary_Table'!$I$8,\"Yes\",\"NO\")","v":"Yes"}]
[null,null,null,null,null,null,null,null,null,null,null,null,0,{"$error":"#VALUE!"},{"$error":"#VALUE!"},0,{"$error":"#VALUE!"},{"$error":"#VALUE!"},0,{"$error":"#VALUE!"},{"$f":"IF(S1735<='Collection System Summary_Table'!$I$8,\"Yes\",\"NO\")","v":"Yes"}]

{"sheet":"Pipes by Materials_Dashboard","index":17,"n_rows":3,"n_cols":2,"rows_kept":3,"cut":false,"hidden":false,"merged":[]}
["Material","Sum of LengthMiles"]
["(blank)"]
["Grand Total"]

{"sheet":"Pipes by Age_Dashboard","index":18,"n_rows":3,"n_cols":2,"rows_kept":3,"cut":false,"hidden":false,"merged":[]}
["Age","Sum of LengthMiles"]
["(blank)"]
["Grand Total"]

{"sheet":"Pipes by Diameter_Dashboard","index":19,"n_rows":3,"n_cols":2,"rows_kept":3,"cut":false,"hidden":false,"merged":[]}
["Diameter","Sum of LengthMiles"]
["(blank)"]
["Grand Total"]

{"sheet":"Risk Summary_Dashboard","index":20,"n_rows":15,"n_cols":5,"rows_kept":15,"cut":false,"hidden":false,"merged":[]}
["Total Risk","Sum of LengthMiles"]
["(blank)"]
["Grand Total"]
[]
[]
[]
[]
[]
[]
[]
[]
[]
[]
[]
[null,null,null,null,{"$f":"2021-1989","v":32}]

{"sheet":"Escalation","index":21,"n_rows":134,"n_cols":15,"rows_kept":134,"cut":false,"hidden":true,"merged":[]}
["COST BASIS:",{"$f":"First_Year_of_Planning_Period","v":2022},null,null,null,null,5948041.1426658053]
[]
["YEAR","YEAR#","FACTOR",null,null,null,"2021-2025",2021,2025,{"$f":"$G$1/5","v":1189608.2285331611},{"$f":"SUM(F4:F7)","v":1190061.6095150253},{"$f":"K3/J3","v":1.0003811178932607},{"$f":"E4*SUM(C4:C7)","v":1190061.609515025},null,{"$f":"AVERAGE(C4:C7)","v":1.0003811178932605}]
[2020,{"$f":"IFERROR(A4-COST_BASIS,\"\")","v":-2},{"$f":"IFERROR((1+Annual_Inflation)^(B4+0.5),\"\")","v":0.96363863087764856},null,{"$f":"$G$1/20","v":297402.05713329028},{"$f":"E4*tblEscalation[[#This Row],[FACTOR]]","v":286588.11115612008},"2025-2029",2025,2029,{"$f":"$G$1/5","v":1189608.2285331611},{"$f":"SUM(F8:F11)","v":1313605.3452206193}]
[{"$f":"IFERROR(IF(A4+1<=2150,A4+1,\"\"),\"\")","v":2021},-1,0.9877295966495897,null,{"$f":"$G$1/20","v":297402.05713329028},{"$f":"E5*tblEscalation[[#This Row],[FACTOR]]","v":293752.81393502303},"2029-2033",2029,2033,1189608.2285331611,{"$f":"SUM(F12:F15)","v":1449974.5132484226}]
[{"$f":"IFERROR(IF(A5+1<=2150,A5+1,\"\"),\"\")","v":2022},0,1.0124228365658292,null,297402.05713329028,{"$f":"E6*tblEscalation[[#This Row],[FACTOR]]","v":301096.63428339857},"2033-2037",2033,2037,1189608.2285331611,{"$f":"SUM(F16:F19)","v":1600500.5588013178}]
[2023,1,1.0377334074799749,null,297402.05713329028,{"$f":"E7*tblEscalation[[#This Row],[FACTOR]]","v":308624.05014048348},"2037-2041",2037,2041,1189608.2285331611,{"$f":"SUM(F20:F23)","v":1766653.1482574102}]
[2024,2,1.0636767426669742,null,297402.05713329028,{"$f":"E8*tblEscalation[[#This Row],[FACTOR]]","v":316339.65139399556}]
[2025,3,1.0902686612336485,null,297402.05713329028,{"$f":"E9*tblEscalation[[#This Row],[FACTOR]]","v":324248.14267884544}]
[2026,4,1.1175253777644896,null,297402.05713329028,{"$f":"E10*tblEscalation[[#This Row],[FACTOR]]","v":332354.3462458165}]
[2027,5,1.1454635122086017,null,297402.05713329028,{"$f":"E11*tblEscalation[[#This Row],[FACTOR]]","v":340663.2049019619}]
[2028,6,1.1741001000138167,null,297402.05713329028,{"$f":"E12*tblEscalation[[#This Row],[FACTOR]]","v":349179.78502451093}]
[2029,7,1.2034526025141621,null,297402.05713329028,{"$f":"E13*tblEscalation[[#This Row],[FACTOR]]","v":357909.27965012373}]
[2030,8,1.2335389175770159,null,297402.05713329028,{"$f":"E14*tblEscalation[[#This Row],[FACTOR]]","v":366857.01164137677}]
[2031,9,1.2643773905164413,null,297402.05713329028,{"$f":"E15*tblEscalation[[#This Row],[FACTOR]]","v":376028.43693241116}]
[2032,10,1.2959868252793521,null,297402.05713329028,{"$f":"E16*tblEscalation[[#This Row],[FACTOR]]","v":385429.14785572136}]
[2033,11,1.3283864959113358,null,297402.05713329028,{"$f":"E17*tblEscalation[[#This Row],[FACTOR]]","v":395064.87655211438}]
[2034,12,1.3615961583091192,null,297402.05713329028,{"$f":"E18*tblEscalation[[#This Row],[FACTOR]]","v":404941.49846591719}]
[2035,13,1.3956360622668469,null,297402.05713329028,{"$f":"E19*tblEscalation[[#This Row],[FACTOR]]","v":415065.03592756507}]
[2036,14,1.4305269638235181,null,297402.05713329028,{"$f":"E20*tblEscalation[[#This Row],[FACTOR]]","v":425441.66182575421}]
[2037,15,1.4662901379191058,null,297402.05713329028,{"$f":"E21*tblEscalation[[#This Row],[FACTOR]]","v":436077.70337139798}]
[2038,16,1.5029473913670832,null,297402.05713329028,{"$f":"E22*tblEscalation[[#This Row],[FACTOR]]","v":446979.64595568285}]
[2039,17,1.5405210761512602,null,297402.05713329028,{"$f":"E23*tblEscalation[[#This Row],[FACTOR]]","v":458154.13710457494}]
[2040,18,1.5790341030550417]
[2041,19,1.6185099556314175]
[2042,20,1.6589727045222027]
[2043,21,1.7004470221352579]
[2044,22,1.742958197688639]
[2045,23,1.7865321526308549]
[2046,24,1.8311954564466262]
[2047,25,1.8769753428577918]
[2048,26,1.9238997264292361]
[2049,27,1.9719972195899671]
[2050,28,2.0212971500797159]
[2051,29,2.0718295788317085]
[2052,{"$f":"IFERROR(A36-COST_BASIS,\"\")","v":30},{"$f":"IFERROR((1+Annual_Inflation)^(B36+0.5),\"\")","v":2.1236253183025013}]
[2053,31,2.1767159512600633]
[2054,32,2.2311338500415649]
[2055,33,2.286912196292604]
[2056,34,2.344085001199919]
[2057,35,2.4026871262299165]
[2058,36,2.4627543043856641]
[2059,37,2.5243231619953055]
[2060,38,2.5874312410451878]
[2061,39,2.6521170220713177]
[2062,40,2.7184199476231004]
[2063,41,2.7863804463136774]
[2064,42,2.8560399574715194]
[2065,43,2.9274409564083066]
[2066,44,3.0006269803185144]
[2067,45,3.0756426548264773]
[2068,46,3.152533721197138]
[2069,47,3.2313470642270667]
[2070,48,3.3121307408327434]
[2071,49,3.3949340093535616]
[2072,50,3.4798073595874]
[2073,51,3.5668025435770847]
[2074,52,3.655972607166512]
[2075,53,3.7473719223456738]
[2076,54,3.8410562204043153]
[2077,55,3.9370826259144232]
[2078,56,4.0355096915622841]
[2079,57,4.1363974338513394]
[2080,58,4.2398073696976235]
[2081,59,4.3458025539400635]
[2082,60,4.4544476177885644]
[2083,61,4.5658088082332782]
[2084,{"$f":"IFERROR(A68-COST_BASIS,\"\")","v":62},{"$f":"IFERROR((1+Annual_Inflation)^(B68+0.5),\"\")","v":4.6799540284391101}]
[2085,63,4.7969528791500879]
[{"$f":"IFERROR(IF(A69+1<=2150,A69+1,\"\"),\"\")","v":2086},64,4.9168767011288388]
[2087,65,5.0397986186570591]
[2088,66,5.1657935841234854]
[2089,67,5.2949384237265731]
[2090,68,5.4273118843197361]
[2091,69,5.5629946814277291]
[2092,70,5.7020695484634221]
[2093,71,5.8446212871750065]
[2094,72,5.9907368193543808]
[2095,73,6.1405052398382409]
[2096,74,6.2940178708341969]
[2097,75,6.4513683176050503]
[2098,76,6.612652525545176]
[2099,77,6.7779688386838055]
[2100,78,6.9474180596508983]
[2101,{"$f":"IFERROR(A85-COST_BASIS,\"\")","v":79},{"$f":"IFERROR((1+Annual_Inflation)^(B85+0.5),\"\")","v":7.121103511142171}]
[2102,80,7.299131098920725]
[2103,81,7.4816093763937417]
[2104,82,7.6686496108035866]
[2105,83,7.8603658510736736]
[2106,84,8.0568749973505138]
[2107,85,8.2582968722842782]
[2108,86,8.4647542940913834]
[2109,87,8.6763731514436664]
[2110,{"$f":"IFERROR(A94-COST_BASIS,\"\")","v":88},{"$f":"IFERROR((1+Annual_Inflation)^(B94+0.5),\"\")","v":8.8932824802297592}]
[2111,89,9.1156145422354999]
[2112,90,9.3435049057913897]
[2113,91,9.5770925284361734]
[2114,92,9.8165198416470751]
[2115,93,10.061932837688254]
[2116,94,10.313481158630458]
[{"$f":"IFERROR(IF(A100+1<=2150,A100+1,\"\"),\"\")","v":2117},95,10.571318187596216]
[2118,96,10.835601142286123]
[2119,97,11.106491170843274]
[2120,98,11.384153450114352]
[2121,99,11.668757286367214]
[2122,100,11.960476218526392]
[2123,101,12.259488123989549]
[2124,102,12.565975327089289]
[2125,103,12.880124710266518]
[2126,104,13.202127828023183]
[2127,105,13.53218102372376]
[2128,106,13.87048554931685]
[2129,107,14.217247688049776]
[2130,108,14.572678880251015]
[2131,109,14.936995852257287]
[2132,110,15.310420748563722]
[{"$f":"IFERROR(IF(A116+1<=2150,A116+1,\"\"),\"\")","v":2133},111,15.693181267277811]
[2134,112,16.085510798959753]
[2135,113,16.48764856893375]
[2136,114,16.899839783157091]
[2137,115,17.322335777736022]
[2138,116,17.755394172179418]
[2139,117,18.199279026483897]
[2140,118,18.654261002145997]
[2141,119,19.120617527199645]
[2142,120,19.598632965379629]
[2143,121,20.088598789514126]
[2144,122,20.590813759251972]
[2145,123,21.105584103233266]
[2146,124,21.633223705814103]
[2147,125,22.174054298459449]
[2148,126,22.72840565592093]
[2149,127,23.29661579731896]
[{"$f":"IFERROR(IF(A133+1<=2150,A133+1,\"\"),\"\")","v":2150},128,23.879031192251926]