{"text_format":"1","workbook":"xlsx","n_sheets":22,"sheets":["Config","Instructions","Suggested Analysis Framework","Asset Inventory_Pipes","Asset Inventory_Manholes","Model Selection and Inputs","Pipe Unit Costs_Useful Life","Manhole Unit Costs_Useful Life","Consequence of Failure","Likelihood of Failure","Indiv. Pipe Results_Table","Indiv. MH Results_Table","Collection System Summary_Risk","Collection System Summary_Table","Risk-based Cost Forecast","Age-based Cost Forecast","CalsRiskPipes","Pipes by Materials_Dashboard","Pipes by Age_Dashboard","Pipes by Diameter_Dashboard","Risk Summary_Dashboard","Escalation"],"not_rendered":{"charts":8,"images":6,"macros":1,"external_links":1,"defined_names":100,"comments":10,"pivot_tables":9},"unopened":[],"bounds":{"document_bytes":16777216,"sheet_cells":100000,"rows_first":2000,"rows_last":500,"rows_between":2000,"halvings":0,"cell_chars":16384,"cell_head_chars":4096},"cells_cut":0,"cells_raw":0,"read":"whole","date_system":"1900"}

{"sheet":"Config","index":0,"n_rows":23,"n_cols":8,"rows_kept":23,"cut":false,"hidden":true,"merged":[]}
["Sheet Name","Risk Sheet","Age Based Sheet","Inventory Sheet","Inventory and Forecasting Sheet","Protect"]
["Age-based Cost Forecast",false,true,false,true,false,null,"always show (all columns TRUE)"]
["Asset Inventory_Manholes",true,true,true,true,true,null,"never show (all columns FALSE)"]
["Asset Inventory_Pipes",true,true,true,true,true]
["CalsRiskPipes",false,false,false,false,true]
["Collection System Summary_Risk",true,false,false,true,true]
["Collection System Summary_Table",false,true,false,true,true]
["Config",false,false,false,false,false]
{"$rows_left_out":16}
{"sheet":"Instructions","index":1,"n_rows":57,"n_cols":2,"rows_kept":57,"cut":false,"hidden":false,"merged":[[54,1,54,2]]}
[]
[]
[]
[]
[]
[]
[]
[]
{"$rows_left_out":50}
{"sheet":"Suggested Analysis Framework","index":2,"n_rows":0,"n_cols":0,"rows_kept":0,"cut":false,"hidden":false,"merged":[]}

{"sheet":"Asset Inventory_Pipes","index":3,"n_rows":2,"n_cols":15,"rows_kept":2,"cut":false,"hidden":false,"merged":[[0,0,0,6],[0,7,0,14]]}
["Tier 1 Inventory Information ",null,null,null,null,null,null,"Tier 2 Inventory Information"]
["Unique Asset ID","Basin Code, if applicable","Pipe Diameter","Material, select from list","Depth, feet","Known/Estimated Install Date","Pipe Length, feet","Proximity to Water, in feet","Critical Infrastructure Boundaries: Proximity to School or Park, in feet","Critical Infrastructure Boundaries: Proximity to Airport/Medical, in feet","Crosses Roadways, select from list","High Root Areas, select from list","Known High Grease Areas, select from list","Structural Peak Condition Score, select from list (NULL if no data available)","O&M Peak Condition Score, select from list (NULL if no data available)"]

{"sheet":"Asset Inventory_Manholes","index":4,"n_rows":2,"n_cols":8,"rows_kept":2,"cut":false,"hidden":false,"merged":[[0,0,0,5],[0,6,0,7]]}
["Tier 1 Inventory Information ",null,null,null,null,null,"Tier 2 Inventory Information"]
["Unique Asset ID","Basin Code, if applicable","Material, select from list","Inside Diameter, inches","Known/Estimated Install Year","Depth, feet","Upstream Pipe ID","Downstream PipeID"]

{"sheet":"Model Selection and Inputs","index":5,"n_rows":14,"n_cols":5,"rows_kept":14,"cut":false,"hidden":false,"merged":[[2,0,2,1],[2,3,2,4],[7,0,7,1],[7,3,7,4]]}
["Adjust Green Cells Only"]
[]
["Select Model Application",null,null,"Define Planning Horizon"]
["Estimate Rehab Costs by System Risk? ",true,null,"Planning Horizon (years)",20]
["Estimate Rehab Costs by Age?",true,null,"Number of Planning Periods",5]
[null,null,null,"First Year of Planning Period",2022]
[]
["Set Pipe Rehabilitation Rate Assumptions",null,null,"Set Manhole Rehabilitation Rate Assumptions"]
{"$rows_left_out":7}
{"sheet":"Pipe Unit Costs_Useful Life","index":6,"n_rows":45,"n_cols":18,"rows_kept":45,"cut":false,"hidden":false,"merged":[[41,2,41,5],[42,2,42,5],[43,2,43,5],[44,2,44,5],[36,2,36,5],[37,2,37,5],[38,2,38,5],[39,2,39,5],[40,2,40,5],[2,0,2,8],[25,0,25,8],[25,9,25,15],[25,16,26,16],[25,17,26,17],[9,0,9,1],[11,0,11,1]]}
["Adjust Green Cells Only"]
[]
["Unit Costs for Open Cut Pipe Replacment ($/ft)",null,null,null,null,null,null,null,null,null,"Pipe Material Recommendations","Estimated Useful Life (Year)"]
["Pipe Material Types","Pipe Material Groups","Less than 8\"","8\"-10\"","10-12\" ","12-20\"","20-30\"","Greater than 30\"","Unknown",null,"Non-Plastic",50]
["VCP, Unknown, Not lined","Non-Plastic",97.5,117.5,132.5,235,380,650,155,null,"Lined Non-Plastic",50]
["Lined Non-Plastic","Lined Non-Plastic",97.5,117.5,132.5,235,380,650,155,null,"Plastic",75]
["PVC, HDPE","Plastic",97.5,117.5,132.5,235,380,650,155,null,"Unknown",50]
["Unknown","Unknown",97.5,117.5,132.5,235,380,650,180,null," "," "]
{"$rows_left_out":38}
{"sheet":"Manhole Unit Costs_Useful Life","index":7,"n_rows":12,"n_cols":3,"rows_kept":12,"cut":false,"hidden":false,"merged":[[8,0,8,1]]}
["Adjust Green Cells Only"]
[]
["Manhole/Node Material Recommendations","Replacement Unit Cost (Each)","Esimated Useful Life (Year)"]
["Brick",15000,50]
["Precast Concrete",15000,50]
["Plastic/Fiberglass",15000,50]
["Other",15000,50]
[]
{"$rows_left_out":5}
{"sheet":"Consequence of Failure","index":8,"n_rows":33,"n_cols":9,"rows_kept":33,"cut":false,"hidden":false,"merged":[[27,0,31,0],[27,1,31,1],[27,5,31,5],[27,7,31,7],[22,0,25,0],[22,1,25,1],[22,5,25,5],[22,7,25,7],[14,0,16,0],[14,1,16,1],[14,5,16,5],[14,7,16,7],[18,0,21,0],[18,1,21,1],[18,5,21,5],[18,7,21,7],[7,5,9,5],[7,7,9,7],[11,0,13,0],[11,1,13,1],[11,5,13,5],[11,7,13,7],[2,0,2,1],[1,0,1,1],[3,0,3,1],[7,0,9,0],[7,1,9,1]]}
["Adjust Green Cells Only"]
["Max COF Score",null,40]
["Percentage of Total Risk Score:",null,0.4]
["System Mileage",null,{"$f":"SUM(Table3[LengthMiles])","v":0}]
["Consequence of Failure Risk Analysis Matrix"]
["Performance Measure ","Potential GIS Data Source","Scoring Criteria","Scoring Criteria Threshold","Score ","Performance Measure Weight, %","Total Miles","Weighted Max Score"]
["Environment and Public Health"]
["Proximity to Water","NHD Major Rivers, Creeks, Lakes",{"$f":"\"Less than or equal to \" & D8 & \"'\"","v":"Less than or equal to 100'"},100,10,0.3,{"$f":"SUMIF(Table3[Proximity to Water, in feet],\"<=\"&D8,Table3[LengthMiles])","v":0},{"$f":"F8*$C$2","v":12}]
{"$rows_left_out":26}
{"sheet":"Likelihood of Failure","index":9,"n_rows":39,"n_cols":8,"rows_kept":39,"cut":false,"hidden":false,"merged":[[1,0,1,1],[2,0,2,1],[3,0,3,1],[27,7,30,7],[16,5,18,5],[19,5,21,5],[7,7,10,7],[11,7,14,7],[16,7,18,7],[19,7,21,7],[23,7,26,7],[7,0,10,0],[7,1,10,1],[27,1,30,1],[23,1,26,1],[7,5,10,5],[27,5,30,5],[27,0,30,0],[16,0,18,0],[11,5,14,5],[11,1,14,1],[16,1,18,1],[19,0,21,0],[19,1,21,1],[11,0,14,0],[23,0,26,0],[23,5,26,5]]}
["Adjust Green Cells Only"]
["Max LOF Score",null,60]
["Percentage of Total Risk Score:",null,0.6]
["System Mileage",null,{"$f":"SUM(Table3[LengthMiles])","v":0}]
["Likelihood of Failure Risk Analysis Matrix"]
["Performance Measure ","Potential GIS Data Source","Scoring Criteria","Scoring Criteria Threshold","Score ","Performance Measure Weight, %","Total Miles","Weighted Max Score"]
["Age and Material"]
["Age","Attribute data (Used install date for MH, If blank used UPS then DS pipe Install Date, Then Interpolation TOOL",{"$f":"\"Greater than \" &D8 & \" years\"","v":"Greater than 100 years"},100,10,0.1,{"$f":"SUMIF(Table3[Age],\">=\"&D8,Table3[LengthMiles])","v":0},{"$f":"F8*$C$2","v":6}]
{"$rows_left_out":32}
{"sheet":"Indiv. Pipe Results_Table","index":10,"n_rows":1,"n_cols":41,"rows_kept":1,"cut":false,"hidden":false,"merged":[]}
["Unique Asset ID","Basin Code, if applicable","Pipe Diameter","Material, select from list","Depth, feet","Known/Estimated Install Date","Age","Pipe Length, feet","LengthMiles","Proximity to Water, in feet","Critical Infrastructure Boundaries: Proximity to School or Park, in feet","Critical Infrastructure Boundaries: Proximity to Airport/Medical, in feet","Crosses Roadways, select from list","High Root Areas, select from list","Known High Grease Areas, select from list","Structural Peak Condition Score, select from list (NULL if no data available)","O&M Peak Condition Score, select from list (NULL if no data available)","COF_Proximity to Water","COF_SchoolorPark","COF_Medical_Airport","COF_Road","COF_Depth","COF_PipeSize","Total COF Score","LOF Age","LOF Material","LOF Root Area","LOF Grease Area","LOF Structural Score","LOF O&M Score","Total LOF Score","Total Risk","EUL of pipe","YRS Beyond EUL","DIA CAT.","Replacement Unit Cost","Replacement Cost","Weighted Rehab Cost","Cumulative Cost","Rehab Year (Risk Based)","Rehab Year (EUL Based)"]

{"sheet":"Indiv. MH Results_Table","index":11,"n_rows":2,"n_cols":17,"rows_kept":2,"cut":false,"hidden":false,"merged":[]}
["Unique Asset ID","Basin Code, if applicable","Inside Diameter, inches","Material, select from list","Depth, feet","Known/Estimated Install Year","Age","Upstream Pipe ID","Downstream PipeID","COF_Pipe","LOF_Pipe","Total Risk","EUL of MH","YRS Beyond EUL","Replacement Cost","Repair Cost","Lining Cost"]
[null,null,null,null,null,null,{"$f":"IF( TableMH[[#This Row],[Known/Estimated Install Year]]<>\"\",YEAR(TODAY())-(TableMH[[#This Row],[Known/Estimated Install Year]]),\"\")","v":""},null,null,{"$f":"MAX(VLOOKUP(TableMH[[#This Row],[Upstream Pipe ID]],Table3[],24,FALSE),VLOOKUP(TableMH[[#This Row],[Downstream PipeID]],Table3[],24,FALSE))","v":{"$error":"#N/A"}},{"$f":"MAX(VLOOKUP(TableMH[[#This Row],[Downstream PipeID]],Table3[],31,FALSE),VLOOKUP(TableMH[[#This Row],[Upstream Pipe ID]],Table3[],31,FALSE))","v":{"$error":"#N/A"}},{"$f":"TableMH[[#This Row],[COF_Pipe]]+TableMH[[#This Row],[LOF_Pipe]]","v":{"$error":"#N/A"}},{"$f":"VLOOKUP(TableMH[[#This Row],[Material, select from list]],'Manhole Unit Costs_Useful Life'!$A$4:$C$7,3,FALSE)","v":{"$error":"#N/A"}},{"$f":"TableMH[[#This Row],[Age]]-TableMH[[#This Row],[EUL of MH]]","v":{"$error":"#VALUE!"}},{"$f":"VLOOKUP(TableMH[[#This Row],[Material, select from list]],'Manhole Unit Costs_Useful Life'!$A$4:$C$7,2,FALSE)*1","v":{"$error":"#N/A"}},{"$f":"TableMH[[#This Row],[Replacement Cost]]*RepairCostMH","v":{"$error":"#N/A"}},{"$f":"TableMH[[#This Row],[Replacement Cost]]*LiningCostMH","v":{"$error":"#N/A"}}]

{"sheet":"Collection System Summary_Risk","index":12,"n_rows":53,"n_cols":19,"rows_kept":53,"cut":false,"hidden":false,"merged":[[28,12,31,12],[28,13,31,13],[28,14,31,14],[32,12,33,12],[32,13,33,13],[32,14,33,14],[28,10,31,10],[28,11,31,11],[32,2,33,2],[32,3,33,3],[32,4,33,4],[32,5,33,5],[32,6,33,6],[32,7,33,7],[32,8,33,8],[32,9,33,9],[32,10,33,10],[32,11,33,11],[5,6,5,13],[5,0,5,5],[32,15,33,15],[27,0,27,16],[28,2,31,2],[28,3,31,3],[28,4,31,4],[28,5,31,5],[28,6,31,6],[28,7,31,7],[28,8,31,8],[28,15,31,15],[28,16,31,16],[32,0,33,0],[32,1,33,1],[28,9,31,9]]}
["Risk Breaks "," "]
["High",45]
["Medium ",35]
["Low",25]
["Pipe Data"]
["System Estimates",null,null,null,null,null,"Total Mileage and Costs"]
["Pipe Material","% of Total System","System Mileage","Miles within Low Risk","Miles within Medium Risk ","Miles within High Risk","Miles Estimated For Repair","Miles Estimated for Lining ","Miles Estimated for Replacement","Miles Estimated For Rehabilitation","Estimated Repair Costs","Total Estimated Lining Costs","Total Estimated Replacement Costs","Total Estimated Rehabilitation Costs"]
["Non-Plastic",{"$f":"(SUMIF(Table3[Material, select from list],\"=\"&A8,Table3[LengthMiles]))/SUM(Table3[LengthMiles])","v":{"$error":"#DIV/0!"}},{"$f":"(SUMIF(Table3[Material, select from list],\"=\"&A8,Table3[LengthMiles]))","v":0},{"$f":"(SUMIFS(Table3[LengthMiles],Table3[Material, select from list],\"=\"&A8,Table3[Total Risk],\"<=\" &LowRiskBreak))","v":0},{"$f":"(SUMIFS(Table3[LengthMiles],Table3[Material, select from list],\"=\"&A8,Table3[Total Risk],\"<\" &HighRiskBreak,Table3[Total Risk],\">=\" &LowRiskBreak))","v":0},{"$f":"(SUMIFS(Table3[LengthMiles],Table3[Material, select from list],\"=\"&A8,Table3[Total Risk],\">=\" &HighRiskBreak))","v":0},{"$f":"(Table47[[#This Row],[Miles within High Risk]]+Table47[[#This Row],[Miles within Medium Risk ]]+Table47[[#This Row],[Miles within Low Risk]])*RepairRate*yield_pipe","v":0},{"$f":"(Table47[[#This Row],[Miles within High Risk]]+Table47[[#This Row],[Miles within Medium Risk ]]+Table47[[#This Row],[Miles within Low Risk]])*LiningRate*yield_pipe","v":0},{"$f":"(Table47[[#This Row],[Miles within High Risk]]+Table47[[#This Row],[Miles within Medium Risk ]]+Table47[[#This Row],[Miles within Low Risk]])*ReplacementRate*yield_pipe","v":0},{"$f":"SUM(Table47[[#This Row],[Miles Estimated For Repair]:[Miles Estimated for Replacement]])","v":0},{"$f":"SUMIFS(Table3[Replacement Cost],Table3[Material, select from list],\"=\"&A8,Table3[Total Risk],\">=0\" )*RepairRate*RepairPctUC*yield_pipe","v":0},{"$f":"SUMIFS(Table3[Replacement Cost],Table3[Material, select from list],\"=\"&A8,Table3[Total Risk],\">=0\" )*LiningRate*LiningPctUC*yield_pipe","v":0},{"$f":"SUMIFS(Table3[Replacement Cost],Table3[Material, select from list],\"=\"&A8,Table3[Total Risk],\">=0\" )*ReplacementRate*ReplacementPctUC*yield_pipe","v":0},{"$f":"K8+L8+M8","v":0}]
{"$rows_left_out":46}
{"sheet":"Collection System Summary_Table","index":13,"n_rows":49,"n_cols":19,"rows_kept":49,"cut":false,"hidden":true,"merged":[[28,14,29,14],[28,15,29,15],[28,2,29,2],[28,3,29,3],[28,4,29,4],[28,5,29,5],[28,6,29,6],[28,7,29,7],[28,8,29,8],[28,9,29,9],[28,10,29,10],[28,11,29,11],[28,12,29,12],[28,13,29,13],[1,0,1,4],[23,0,23,16],[24,2,27,2],[24,3,27,3],[24,4,27,4],[24,5,27,5],[24,6,27,6],[24,7,27,7],[24,8,27,8],[24,14,27,14],[24,15,27,15],[24,16,27,16],[24,12,27,12],[24,13,27,13],[1,5,1,12],[28,0,29,0],[28,1,29,1],[24,9,27,9],[24,10,27,10],[24,11,27,11]]}
["Pipe Data"]
["System Estimates",null,null,null,null,"Total Mileage and Costs"]
["Pipe Material","% of Total System","System Mileage","Miles with Remaining Useful Life","Miles Beyond Useful Life","Miles Estimated for Repair","Miles Estimated for Lining ","Miles Estimated for Replacement","Miles Estimated For Rehabilitation","Estimated Repair Costs","Total Estimated Lining Costs","Total Estimated Replacement Costs","Total Estimated Rehabilitation Costs"]
["Non-Plastic",{"$f":"(SUMIF(Table3[Material, select from list],\"=\"&A4,Table3[LengthMiles]))/SUM(Table3[LengthMiles])","v":{"$error":"#DIV/0!"}},{"$f":"(SUMIF(Table3[Material, select from list],\"=\"&A4,Table3[LengthMiles]))","v":0},{"$f":"(SUMIFS(Table3[LengthMiles],Table3[Material, select from list],\"=\"&A4,Table3[YRS Beyond EUL],\"<0\" ))","v":0},{"$f":"(SUMIFS(Table3[LengthMiles],Table3[Material, select from list],\"=\"&A4,Table3[YRS Beyond EUL],\">=0\" ))","v":0},{"$f":"C4*yield_pipe*RepairRate","v":0},{"$f":"C4*LiningRate*yield_pipe","v":0},{"$f":"C4*yield_pipe*ReplacementRate","v":0},{"$f":"F4+G4+H4","v":0},{"$f":"(SUMIF(Table3[Material, select from list],\"=\"&A4,Table3[Replacement Cost]))*RepairRate*RepairPctUC*yield_pipe","v":0},{"$f":"(SUMIF(Table3[Material, select from list],\"=\"&A4,Table3[Replacement Cost]))*LiningRate*LiningPctUC*yield_pipe","v":0},{"$f":"(SUMIF(Table3[Material, select from list],\"=\"&A4,Table3[Replacement Cost]))*ReplacementRate*ReplacementPctUC*yield_pipe","v":0},{"$f":"J4+K4+L4","v":0}]
["Lined Non-Plastic",{"$f":"(SUMIF(Table3[Material, select from list],\"=\"&A5,Table3[LengthMiles]))/SUM(Table3[LengthMiles])","v":{"$error":"#DIV/0!"}},{"$f":"(SUMIF(Table3[Material, select from list],\"=\"&A5,Table3[LengthMiles]))","v":0},{"$f":"(SUMIFS(Table3[LengthMiles],Table3[Material, select from list],\"=\"&A5,Table3[YRS Beyond EUL],\"<0\" ))","v":0},{"$f":"(SUMIFS(Table3[LengthMiles],Table3[Material, select from list],\"=\"&A5,Table3[YRS Beyond EUL],\">=0\" ))","v":0},{"$f":"E5*yield_pipe*RepairRate","v":0},{"$f":"E5*LiningRate*yield_pipe","v":0},{"$f":"E5*yield_pipe*ReplacementRate","v":0},{"$f":"F5+G5+H5","v":0},{"$f":"(SUMIF(Table3[Material, select from list],\"=\"&A5,Table3[Replacement Cost]))*RepairRate*RepairPctUC*yield_pipe","v":0},{"$f":"(SUMIF(Table3[Material, select from list],\"=\"&A5,Table3[Replacement Cost]))*LiningRate*LiningPctUC*yield_pipe","v":0},{"$f":"(SUMIF(Table3[Material, select from list],\"=\"&A5,Table3[Replacement Cost]))*ReplacementRate*ReplacementPctUC*yield_pipe","v":0},{"$f":"J5+K5+L5","v":0}]
["Plastic",{"$f":"(SUMIF(Table3[Material, select from list],\"=\"&A6,Table3[LengthMiles]))/SUM(Table3[LengthMiles])","v":{"$error":"#DIV/0!"}},{"$f":"(SUMIF(Table3[Material, select from list],\"=\"&A6,Table3[LengthMiles]))","v":0},{"$f":"(SUMIFS(Table3[LengthMiles],Table3[Material, select from list],\"=\"&A6,Table3[YRS Beyond EUL],\"<0\" ))","v":0},{"$f":"(SUMIFS(Table3[LengthMiles],Table3[Material, select from list],\"=\"&A6,Table3[YRS Beyond EUL],\">=0\" ))","v":0},{"$f":"E6*yield_pipe*RepairRate","v":0},{"$f":"E6*LiningRate*yield_pipe","v":0},{"$f":"E6*yield_pipe*ReplacementRate","v":0},0,{"$f":"(SUMIF(Table3[Material, select from list],\"=\"&A6,Table3[Replacement Cost]))*RepairRate*RepairPctUC*yield_pipe","v":0},{"$f":"(SUMIF(Table3[Material, select from list],\"=\"&A6,Table3[Replacement Cost]))*LiningRate*LiningPctUC*yield_pipe","v":0},{"$f":"(SUMIF(Table3[Material, select from list],\"=\"&A6,Table3[Replacement Cost]))*ReplacementRate*ReplacementPctUC*yield_pipe","v":0},{"$f":"J6+K6+L6","v":0}]
["Unknown",{"$f":"(SUMIF(Table3[Material, select from list],\"=\"&A7,Table3[LengthMiles]))/SUM(Table3[LengthMiles])","v":{"$error":"#DIV/0!"}},{"$f":"(SUMIF(Table3[Material, select from list],\"=\"&A7,Table3[LengthMiles]))","v":0},{"$f":"(SUMIFS(Table3[LengthMiles],Table3[Material, select from list],\"=\"&A7,Table3[YRS Beyond EUL],\"<0\" ))","v":0},{"$f":"(SUMIFS(Table3[LengthMiles],Table3[Material, select from list],\"=\"&A7,Table3[YRS Beyond EUL],\">=0\" ))","v":0},{"$f":"E7*yield_pipe*RepairRate","v":0},{"$f":"E7*LiningRate*yield_pipe","v":0},{"$f":"E7*yield_pipe*ReplacementRate","v":0},{"$f":"F7+G7+H7","v":0},{"$f":"(SUMIF(Table3[Material, select from list],\"=\"&A7,Table3[Replacement Cost]))*RepairRate*RepairPctUC*yield_pipe","v":0},{"$f":"(SUMIF(Table3[Material, select from list],\"=\"&A7,Table3[Replacement Cost]))*LiningRate*LiningPctUC*yield_pipe","v":0},{"$f":"(SUMIF(Table3[Material, select from list],\"=\"&A7,Table3[Replacement Cost]))*ReplacementRate*ReplacementPctUC*yield_pipe","v":0},{"$f":"J7+K7+L7","v":0}]
["Total",{"$f":"SUM(B4:B7)","v":{"$error":"#DIV/0!"}},0,0,{"$f":"SUM(E4:E7)","v":0},0,0,0,{"$f":"SUM(I4:I7)","v":0},0,0,0,0]
{"$rows_left_out":42}
{"sheet":"Risk-based Cost Forecast","index":14,"n_rows":4,"n_cols":38,"rows_kept":4,"cut":false,"hidden":false,"merged":[]}
[]
[]
[null,null,null,null,null,null,null,null,null,null,null,null,null,null,null,null,null,null,null,null,null,null,null,null,null,null,"Row Labels","Cumulative Repair Costs","Cumulative Lining Costs","Cumulative Replacement Costs",null,null,null,null,"Row Labels","Total Estimated Repair_Costs","Total Estimated Lining_Costs","Total Estimated Replacement_Costs"]
[null,null,null,null,null,null,null,null,null,null,null,null,null,null,null,null,null,null,null,null,null,null,null,null,null,null,"Grand Total",null,null,null,null,null,null,null,"Grand Total"]

{"sheet":"Age-based Cost Forecast","index":15,"n_rows":2,"n_cols":26,"rows_kept":2,"cut":false,"hidden":true,"merged":[]}
[null,null,null,null,null,null,null,null,null,null,null,null,null,null,null,null,"Row Labels","Estimated Repair Costs","Estimated Lining Costs","Estimated Replacement Costs",null,null,"Row Labels","Cumulative Repair Costs","Cumulative  Lining Costs","Cumulative  Replacement Costs"]
[null,null,null,null,null,null,null,null,null,null,null,null,null,null,null,null,"Grand Total",null,null,null,null,null,"Grand Total"]

{"sheet":"CalsRiskPipes","index":16,"n_rows":1735,"n_cols":21,"rows_kept":1735,"cut":false,"hidden":true,"merged":[]}
[null,null,null,null,null,null,null,null,null,"Leftover $",null,{"$f":"SUM(L3:L263)","v":0},{"$f":"SUM(P3:P7000)+SUM(Q3:Q70000)+SUM(R3:R70000)","v":{"$error":"#VALUE!"}},null,null,{"$f":"B3-SUM(P3:P700000)","v":0},{"$f":"(B4+P1)-SUM(Q3:Q700000)","v":{"$error":"#VALUE!"}},{"$f":"(B5+Q1 )-SUM(R3:R700000)","v":{"$error":"#VALUE!"}},null,null,{"$f":"SUMIF(U3:U1735,\"YES\",U3:U1735)","v":0}]
["MAX EUL Age",{"$f":"MAX(Table3[YRS Beyond EUL])","v":0},null,null,null,"Total Risk","Sum of Replacement Cost","Sum of LengthMiles",null,null,null,null,"Replace Lines","Lining Lines","Repair Lines","Replace Lines","Lining Lines","Repair Lines","BY Miles","Within EUL Planning Period For Renewal By Cost","In Planning By Miles"]
["Total Replacement",{"$f":"MAX(Table47[Total Estimated Replacement Costs])","v":0},null,null,null,"(blank)",null,null,null,null,null,null,{"$f":"I3","v":0},{"$f":"IF(P3=0,I3+N2,0)","v":{"$error":"#VALUE!"}},{"$f":"IF(AND(Q3=0,P3=0),K3+O2,0)","v":{"$error":"#VALUE!"}},{"$f":"IF(M3<=$B$3,I3,0)","v":0},{"$f":"IF(AND(P3=0,N3<($B$4+$P$1)),J3,0)","v":{"$error":"#VALUE!"}},{"$f":"IF(AND(P3=0,Q3=0,O3<($B$5+$Q$1)),K3,0)","v":{"$error":"#VALUE!"}},{"$f":"L3","v":0},{"$f":"IF(OR(P3>1,Q3>1,R3>1),\"YES\",\"NO\")","v":{"$error":"#VALUE!"}},{"$f":"IF(S3<='Collection System Summary_Table'!$I$8,\"Yes\",\"NO\")","v":"Yes"}]
["Total Lining ",{"$f":"MAX(Table47[Estimated Repair Costs])","v":0},null,null,null,"Grand Total",null,null,null,null,null,null,{"$f":"M3+I4","v":0},{"$error":"#VALUE!"},{"$f":"IF(AND(Q4=0,P4=0),K4+O3,0)","v":{"$error":"#VALUE!"}},{"$f":"IF(M4<=$B$3,I4,0)","v":0},{"$f":"IF(AND(P4=0,N4<($B$4+$P$1)),J4,0)","v":{"$error":"#VALUE!"}},{"$f":"IF(AND(P4=0,Q4=0,O4<($B$5+$Q$1)),K4,0)","v":{"$error":"#VALUE!"}},{"$f":"S3+L4","v":0},{"$f":"IF(OR(P4>1,Q4>1,R4>1),\"YES\",\"NO\")","v":{"$error":"#VALUE!"}},{"$f":"IF(S4<='Collection System Summary_Table'!$I$8,\"Yes\",\"NO\")","v":"Yes"}]
["Total Repair",{"$f":"MAX(Table47[Total Estimated Lining Costs])","v":0},null,null,null,null,null,null,null,null,null,null,{"$f":"M4+I5","v":0},{"$error":"#VALUE!"},{"$error":"#VALUE!"},{"$f":"IF(M5<=$B$3,I5,0)","v":0},{"$error":"#VALUE!"},{"$error":"#VALUE!"},0,{"$error":"#VALUE!"},{"$f":"IF(S5<='Collection System Summary_Table'!$I$8,\"Yes\",\"NO\")","v":"Yes"}]
["Total Rehab Amount",{"$f":"MAX(Table47[Total Estimated Rehabilitation Costs])","v":0},null,null,null,null,null,null,null,null,null,null,0,{"$error":"#VALUE!"},{"$error":"#VALUE!"},0,{"$error":"#VALUE!"},{"$error":"#VALUE!"},0,{"$error":"#VALUE!"},{"$f":"IF(S6<='Collection System Summary_Table'!$I$8,\"Yes\",\"NO\")","v":"Yes"}]
["Total Replacement",{"$f":"MAX(Table47[Miles Estimated for Replacement])","v":0},null,null,null,null,null,null,null,null,null,null,0,{"$error":"#VALUE!"},{"$error":"#VALUE!"},0,{"$error":"#VALUE!"},{"$error":"#VALUE!"},0,{"$error":"#VALUE!"},{"$f":"IF(S7<='Collection System Summary_Table'!$I$8,\"Yes\",\"NO\")","v":"Yes"}]
["Total Lining ",{"$f":"MAX(Table47[[Miles Estimated for Lining ]])","v":0},null,null,null,null,null,null,null,null,null,null,0,{"$error":"#VALUE!"},{"$error":"#VALUE!"},0,{"$error":"#VALUE!"},{"$error":"#VALUE!"},0,{"$error":"#VALUE!"},{"$f":"IF(S8<='Collection System Summary_Table'!$I$8,\"Yes\",\"NO\")","v":"Yes"}]
{"$rows_left_out":1728}
{"sheet":"Pipes by Materials_Dashboard","index":17,"n_rows":3,"n_cols":2,"rows_kept":3,"cut":false,"hidden":false,"merged":[]}
["Material","Sum of LengthMiles"]
["(blank)"]
["Grand Total"]

{"sheet":"Pipes by Age_Dashboard","index":18,"n_rows":3,"n_cols":2,"rows_kept":3,"cut":false,"hidden":false,"merged":[]}
["Age","Sum of LengthMiles"]
["(blank)"]
["Grand Total"]

{"sheet":"Pipes by Diameter_Dashboard","index":19,"n_rows":3,"n_cols":2,"rows_kept":3,"cut":false,"hidden":false,"merged":[]}
["Diameter","Sum of LengthMiles"]
["(blank)"]
["Grand Total"]

{"sheet":"Risk Summary_Dashboard","index":20,"n_rows":15,"n_cols":5,"rows_kept":15,"cut":false,"hidden":false,"merged":[]}
["Total Risk","Sum of LengthMiles"]
["(blank)"]
["Grand Total"]
[]
[]
[]
[]
[]
{"$rows_left_out":8}
{"sheet":"Escalation","index":21,"n_rows":134,"n_cols":15,"rows_kept":134,"cut":false,"hidden":true,"merged":[]}
["COST BASIS:",{"$f":"First_Year_of_Planning_Period","v":2022},null,null,null,null,5948041.1426658053]
[]
["YEAR","YEAR#","FACTOR",null,null,null,"2021-2025",2021,2025,{"$f":"$G$1/5","v":1189608.2285331611},{"$f":"SUM(F4:F7)","v":1190061.6095150253},{"$f":"K3/J3","v":1.0003811178932607},{"$f":"E4*SUM(C4:C7)","v":1190061.609515025},null,{"$f":"AVERAGE(C4:C7)","v":1.0003811178932605}]
[2020,{"$f":"IFERROR(A4-COST_BASIS,\"\")","v":-2},{"$f":"IFERROR((1+Annual_Inflation)^(B4+0.5),\"\")","v":0.96363863087764856},null,{"$f":"$G$1/20","v":297402.05713329028},{"$f":"E4*tblEscalation[[#This Row],[FACTOR]]","v":286588.11115612008},"2025-2029",2025,2029,{"$f":"$G$1/5","v":1189608.2285331611},{"$f":"SUM(F8:F11)","v":1313605.3452206193}]
[{"$f":"IFERROR(IF(A4+1<=2150,A4+1,\"\"),\"\")","v":2021},-1,0.9877295966495897,null,{"$f":"$G$1/20","v":297402.05713329028},{"$f":"E5*tblEscalation[[#This Row],[FACTOR]]","v":293752.81393502303},"2029-2033",2029,2033,1189608.2285331611,{"$f":"SUM(F12:F15)","v":1449974.5132484226}]
[{"$f":"IFERROR(IF(A5+1<=2150,A5+1,\"\"),\"\")","v":2022},0,1.0124228365658292,null,297402.05713329028,{"$f":"E6*tblEscalation[[#This Row],[FACTOR]]","v":301096.63428339857},"2033-2037",2033,2037,1189608.2285331611,{"$f":"SUM(F16:F19)","v":1600500.5588013178}]
[2023,1,1.0377334074799749,null,297402.05713329028,{"$f":"E7*tblEscalation[[#This Row],[FACTOR]]","v":308624.05014048348},"2037-2041",2037,2041,1189608.2285331611,{"$f":"SUM(F20:F23)","v":1766653.1482574102}]
[2024,2,1.0636767426669742,null,297402.05713329028,{"$f":"E8*tblEscalation[[#This Row],[FACTOR]]","v":316339.65139399556}]
{"$rows_left_out":126}